{"text_format":"1","workbook":"xlsx","n_sheets":12,"sheets":["Services-Produits","Reference","Patients","Escy Soeleiman","Muhamad Mardiono","Wahyu Widada","Test 2 pages","Feuil2","Feuil3","Feuil4","Reference1","Menu"],"not_rendered":{"charts":0,"images":5,"macros":1,"external_links":0,"defined_names":1,"comments":0,"pivot_tables":0},"unopened":[],"bounds":{"document_bytes":16777216,"sheet_cells":100000,"rows_first":2000,"rows_last":500,"rows_between":2000,"halvings":0,"cell_chars":16384,"cell_head_chars":4096},"cells_cut":0,"cells_raw":0,"read":"whole","date_system":"1900"}

{"sheet":"Services-Produits","index":0,"n_rows":91,"n_cols":2,"rows_kept":91,"cut":false,"hidden":false,"merged":[]}
["Produit","Price"]
["Abbott Freestyle 2",91.4]
["Abbott Sensor",65.3]
["Bactoflor",69.8]
["Biotin",37.25]
["Biotin + NaCl",37.25]
["B-Kompleks",46.8]
["Black cumin capsules",34.799999999999997]
["Bosvene Akba",215.11]
["Cholin Inject",43]
["C-Intercell 650 mg Vitamin C, 90 Kapseln",27.99]
["Curcumin + NaCl 0,9%",116.22]
["Curcumin 150 mg",229.2]
["curcumin 75 mg",116.22]
["E-Inject",41.2]
["Epinativ Injection",133.61000000000001]
["Face treatment Chin contouring",600]
["Fermanose",46.2]
["Fiber-Intercell",40.49]
["Gut Microbiome Therapy",6912.5]
["Gynophilus",19.8]
["Gynophylus",19.8]
["Hepar",43.7]
["Hydroxiprolin",68.900000000000006]
["Hypericin",198.7]
["Immunocare",220]
["Immunocare, personalised",195.7]
["Infraorbital",600]
["Infusion: Curcumin 75 mg",116.22]
["Infusion: Nicotiamide",179.8]
["Infusion: Shoga Öl",670]
["Jantung (Herz)",584.5]
["K2 & D3",34.700000000000003]
["Kantong kemih (Harnblase)",381.35]
["Laetia",45.3]
["Liserotota",345.3]
["Liv 52",14.9]
["Magentropfen",23]
["Magnesium",25.45]
["Magnesium 1000 mg",34.68]
{"$rows_left_out":52}
{"sheet":"Reference","index":1,"n_rows":40,"n_cols":4,"rows_kept":40,"cut":false,"hidden":false,"merged":[]}
[]
[]
["Invoice: 55H-0231115"]
["                  15.01.2024"]
[null,null,"Treatment by"]
[null,null,"Dr. Roger Gmür"]
[null,null,"Zürich"]
[]
[]
[]
[]
[]
[]
["Description","Qty","Price","Amount"]
[]
[]
["Gut Microbiome Therapy",4,{"$f":"IFERROR(VLOOKUP(A17,'Services-Produits'!A1:B120,2,FALSE),\"\")","v":6912.5},{"$f":"IFERROR(B17*C17,\"\")","v":27650}]
[null,null,{"$f":"IFERROR(VLOOKUP(A18,'Services-Produits'!A2:B121,2,FALSE),\"\")","v":""},{"$f":"IFERROR(B18*C18,\"\")","v":""}]
[null,null,{"$f":"IFERROR(VLOOKUP(A19,'Services-Produits'!A3:B122,2,FALSE),\"\")","v":""},""]
[null,null,{"$f":"IFERROR(VLOOKUP(A20,'Services-Produits'!A4:B123,2,FALSE),\"\")","v":""},""]
[null,null,{"$f":"IFERROR(VLOOKUP(A21,'Services-Produits'!A5:B124,2,FALSE),\"\")","v":""},""]
[null,null,{"$f":"IFERROR(VLOOKUP(A22,'Services-Produits'!A6:B125,2,FALSE),\"\")","v":""},""]
[null,null,{"$f":"IFERROR(VLOOKUP(A23,'Services-Produits'!A7:B126,2,FALSE),\"\")","v":""},""]
[null,null,{"$f":"IFERROR(VLOOKUP(A24,'Services-Produits'!A8:B127,2,FALSE),\"\")","v":""},""]
[null,null,{"$f":"IFERROR(VLOOKUP(A25,'Services-Produits'!A9:B128,2,FALSE),\"\")","v":""},""]
[null,null,{"$f":"IFERROR(VLOOKUP(A26,'Services-Produits'!A10:B129,2,FALSE),\"\")","v":""},""]
[null,null,{"$f":"IFERROR(VLOOKUP(A27,'Services-Produits'!A11:B130,2,FALSE),\"\")","v":""},""]
[null,null,{"$f":"IFERROR(VLOOKUP(A28,'Services-Produits'!A12:B131,2,FALSE),\"\")","v":""},""]
[null,null,{"$f":"IFERROR(VLOOKUP(A29,'Services-Produits'!A13:B132,2,FALSE),\"\")","v":""},""]
[null,null,{"$f":"IFERROR(VLOOKUP(A30,'Services-Produits'!A14:B133,2,FALSE),\"\")","v":""},""]
[null,null,{"$f":"IFERROR(VLOOKUP(A31,'Services-Produits'!A8:B127,2,FALSE),\"\")","v":""},""]
[null,null,{"$f":"IFERROR(VLOOKUP(A32,'Services-Produits'!A9:B128,2,FALSE),\"\")","v":""},""]
[null,null,{"$f":"IFERROR(VLOOKUP(A33,'Services-Produits'!A10:B129,2,FALSE),\"\")","v":""},""]
[null,null,{"$f":"IFERROR(VLOOKUP(A34,'Services-Produits'!A11:B130,2,FALSE),\"\")","v":""},""]
[null,null,{"$f":"IFERROR(VLOOKUP(A35,'Services-Produits'!A12:B131,2,FALSE),\"\")","v":""},""]
[null,null,{"$f":"IFERROR(VLOOKUP(A36,'Services-Produits'!A13:B132,2,FALSE),\"\")","v":""},""]
[null,null,{"$f":"IFERROR(VLOOKUP(A37,'Services-Produits'!A14:B133,2,FALSE),\"\")","v":""}]
["Total in CHF",null,null,{"$f":"SUM(D17:D37)","v":27650}]
[]
["Thank you very much for your trust!"]
{"$rows_left_out":1}
{"sheet":"Patients","index":2,"n_rows":36,"n_cols":8,"rows_kept":36,"cut":false,"hidden":false,"merged":[]}
["Adex Yudiswan",null,null,"Jakarta","Indonesia","M","1974-12-03","SM"]
["Agus Andriyanto",null,null,"Jakarta","Indonesia","M","1967-02-16","SM"]
["Armand Wahyudi Hartono",null,null,"Jakarta","Indonesia","M","1975-05-20","SM"]
["Budi Satrio",null,null,"Jakarta","Indonesia","M","1976-05-31","SBL"]
["Chan Choi Moi",null,null,"Jakarta","Indonesia","F","1972-04-28","SM"]
["Deddy Prasetyo",null,null,"Jakarta","Indonesia","M","1968-07-26","SM"]
["Dian Suri Iriani",null,null,"Jakarta","Indonesia","F","1979-08-02","SBL"]
["Dobias Iskandar",null,null,"Jakarta","Indonesia","M","1965-11-16","SM"]
["Eileen Patricia Hartono",null,null,"Jakarta","Indonesia","F","1973-05-01","SBL"]
["Erminda Melayeni",null,null,"Jakarta","Indonesia","F","1975-10-25","SM"]
["Escy Soeleiman",null,null,"Jakarta","Indonesia","F","1965-12-09","SBL"]
["Evy Celiyanti",null,null,"Jakarta","Indonesia","F","1972-03-07","SM"]
["Herman Herry Adranacus",null,null,"Jakarta","Indonesia","M","1962-11-26","SM"]
["Isandi Harahap",null,null,"Jakarta","Indonesia","M","1958-12-10","SBL"]
["Karyoto",null,null,"Jakarta","Indonesia","M","1968-10-27","SBL"]
["Lina Iskandar",null,null,"Jakarta","Indonesia","F","1970-06-25","SBL"]
["Martha Dwi Maryani",null,null,"Jakarta","Indonesia","F","1969-05-21","SM"]
["Muhamad Mardiono",null,null,"Jakarta","Indonesia","M","1957-07-11","SM"]
["Muljadi Tjahjono",null,null,"Jakarta","Indonesia","M","1965-07-22","SM"]
["Nyoman Adhi Suryadnyana",null,null,"Jakarta","Indonesia","M","1974-10-15","SBL"]
["Romyus Permana",null,null,"Jakarta","Indonesia","M","1978-10-20","SBL"]
["Salim Lan Jaya Liem",null,null,"Jakarta","Indonesia","M","1971-06-01","SM"]
["Samuel Bob",null,null,"Jakarta","Indonesia","M","1974-01-04","SM"]
["Samuel Rusli",null,null,"Jakarta","Indonesia","M","1968-04-01","SM"]
["Shanti Tan",null,null,"Jakarta","Indonesia","F","1978-09-10","SBL"]
["Shu Shu",null,null,"Jakarta","Indonesia","F",null,"SBL"]
["Sri Wahyuswinta",null,null,"Jakarta","Indonesia","F","1969-04-04","SM"]
["Tan Kim Siong",null,null,"Jakarta","Indonesia","M","1970-11-09","SM"]
["Tan Siew Chang",null,null,"Jakarta","Indonesia","F","1967-01-13","SM"]
["Titi Salim",null,null,"Jakarta","Indonesia","M","1971-06-01","SBL"]
["Wahyu Widada",null,null,"Jakarta","Indonesia","M","1969-09-11","SM"]
["Wisnu Hermawan",null,null,"Jakarta","Indonesia","M","1972-02-16","SM"]
["Yenni Rista S",null,null,"Jakarta","Indonesia","F","1958-07-18","SBL"]
["Yenny Wijaya",null,null,"Jakarta","Indonesia","F","1973-03-16","SM"]
["Yuldi Yusman",null,null,"Jakarta","Indonesia","M","1975-07-29","SM"]
["Yulia Gunawan",null,null,"Jakarta","Indonesia","F","1983-01-06","SM"]

{"sheet":"Escy Soeleiman","index":3,"n_rows":40,"n_cols":4,"rows_kept":40,"cut":false,"hidden":false,"merged":[]}
[]
[]
["Invoice: 55H-0231115"]
["                  15.01.2024"]
[null,null,"Treatment by"]
[null,null,"Dr. Roger Gmür"]
[null,null,"Zürich"]
[]
["Mrs. Escy Soeleiman"]
["Jakarta"]
["Indonesia"]
[]
[]
["Description","Qty","Price","Amount"]
["Patient: Escy Soeleiman, F, 09.12.1965"]
[]
["Gut Microbiome Therapy",4,{"$f":"IFERROR(VLOOKUP(A17,'Services-Produits'!A1:B120,2,FALSE),\"\")","v":6912.5},{"$f":"IFERROR(B17*C17,\"\")","v":27650}]
["Vit, B Komplex",null,{"$f":"IFERROR(VLOOKUP(A18,'Services-Produits'!A2:B121,2,FALSE),\"\")","v":46.8},{"$f":"IFERROR(B18*C18,\"\")","v":0}]
["Resveratrol",null,{"$f":"IFERROR(VLOOKUP(A19,'Services-Produits'!A3:B122,2,FALSE),\"\")","v":178},0]
["Immunocare",null,{"$f":"IFERROR(VLOOKUP(A20,'Services-Produits'!A4:B123,2,FALSE),\"\")","v":220},0]
["Infusion: Curcumin 75 mg",null,{"$f":"IFERROR(VLOOKUP(A21,'Services-Produits'!A5:B124,2,FALSE),\"\")","v":116.22},0]
["E-Inject",null,{"$f":"IFERROR(VLOOKUP(A22,'Services-Produits'!A6:B125,2,FALSE),\"\")","v":41.2},0]
["Vit D3",null,{"$f":"IFERROR(VLOOKUP(A23,'Services-Produits'!A7:B126,2,FALSE),\"\")","v":37},0]
["Vit C",null,{"$f":"IFERROR(VLOOKUP(A24,'Services-Produits'!A8:B127,2,FALSE),\"\")","v":27.99},0]
["Vit. E IM",null,{"$f":"IFERROR(VLOOKUP(A25,'Services-Produits'!A9:B128,2,FALSE),\"\")","v":0},0]
[null,null,{"$f":"IFERROR(VLOOKUP(A26,'Services-Produits'!A10:B129,2,FALSE),\"\")","v":""},""]
[null,null,{"$f":"IFERROR(VLOOKUP(A27,'Services-Produits'!A11:B130,2,FALSE),\"\")","v":""},""]
[null,null,{"$f":"IFERROR(VLOOKUP(A28,'Services-Produits'!A12:B131,2,FALSE),\"\")","v":""},""]
[null,null,{"$f":"IFERROR(VLOOKUP(A29,'Services-Produits'!A13:B132,2,FALSE),\"\")","v":""},""]
[null,null,{"$f":"IFERROR(VLOOKUP(A30,'Services-Produits'!A14:B133,2,FALSE),\"\")","v":""},""]
[null,null,{"$f":"IFERROR(VLOOKUP(A31,'Services-Produits'!A8:B127,2,FALSE),\"\")","v":""},""]
[null,null,{"$f":"IFERROR(VLOOKUP(A32,'Services-Produits'!A9:B128,2,FALSE),\"\")","v":""},""]
[null,null,{"$f":"IFERROR(VLOOKUP(A33,'Services-Produits'!A10:B129,2,FALSE),\"\")","v":""},""]
[null,null,{"$f":"IFERROR(VLOOKUP(A34,'Services-Produits'!A11:B130,2,FALSE),\"\")","v":""},""]
[null,null,{"$f":"IFERROR(VLOOKUP(A35,'Services-Produits'!A12:B131,2,FALSE),\"\")","v":""},""]
[null,null,{"$f":"IFERROR(VLOOKUP(A36,'Services-Produits'!A13:B132,2,FALSE),\"\")","v":""},""]
[null,null,{"$f":"IFERROR(VLOOKUP(A37,'Services-Produits'!A14:B133,2,FALSE),\"\")","v":""}]
["Total in CHF",null,null,{"$f":"SUM(D17:D37)","v":27650}]
[]
["Thank you very much for your trust!"]
{"$rows_left_out":1}
{"sheet":"Muhamad Mardiono","index":4,"n_rows":40,"n_cols":4,"rows_kept":40,"cut":false,"hidden":false,"merged":[]}
[]
[]
["Invoice: 55H-0231115"]
["                  11.01.2024"]
[null,null,"Treatment by"]
[null,null,"Dr. Roger Gmür"]
[null,null,"Zürich"]
[]
["Mr. Muhamad Mardiono"]
["Jakarta"]
["Indonesia"]
[]
[]
["Description","Qty","Price","Amount"]
["Patient: Muhamad Mardiono, M, 11.07.1957"]
[]
["Gut Microbiome Therapy",4,{"$f":"IFERROR(VLOOKUP(A17,'Services-Produits'!A1:B120,2,FALSE),\"\")","v":6912.5},{"$f":"IFERROR(B17*C17,\"\")","v":27650}]
["Riboflavin",5,{"$f":"IFERROR(VLOOKUP(A18,'Services-Produits'!A2:B121,2,FALSE),\"\")","v":127.4},{"$f":"IFERROR(B18*C18,\"\")","v":637}]
["Tadalafil-Mepha 10 mg",9,{"$f":"IFERROR(VLOOKUP(A19,'Services-Produits'!A3:B122,2,FALSE),\"\")","v":115},1035]
["Infusion: Shoga Öl",12,{"$f":"IFERROR(VLOOKUP(A20,'Services-Produits'!A4:B123,2,FALSE),\"\")","v":670},8040]
["Phospolipide",2,{"$f":"IFERROR(VLOOKUP(A21,'Services-Produits'!A5:B124,2,FALSE),\"\")","v":31.28},62.56]
["Bactoflor",null,{"$f":"IFERROR(VLOOKUP(A22,'Services-Produits'!A6:B125,2,FALSE),\"\")","v":""},""]
[null,null,{"$f":"IFERROR(VLOOKUP(A23,'Services-Produits'!A7:B126,2,FALSE),\"\")","v":""},""]
[null,null,{"$f":"IFERROR(VLOOKUP(A24,'Services-Produits'!A8:B127,2,FALSE),\"\")","v":""},""]
[null,null,{"$f":"IFERROR(VLOOKUP(A25,'Services-Produits'!A9:B128,2,FALSE),\"\")","v":""},""]
[null,null,{"$f":"IFERROR(VLOOKUP(A26,'Services-Produits'!A10:B129,2,FALSE),\"\")","v":""},""]
[null,null,{"$f":"IFERROR(VLOOKUP(A27,'Services-Produits'!A11:B130,2,FALSE),\"\")","v":""},""]
[null,null,{"$f":"IFERROR(VLOOKUP(A28,'Services-Produits'!A12:B131,2,FALSE),\"\")","v":""},""]
[null,null,{"$f":"IFERROR(VLOOKUP(A29,'Services-Produits'!A13:B132,2,FALSE),\"\")","v":""},""]
[null,null,{"$f":"IFERROR(VLOOKUP(A30,'Services-Produits'!A14:B133,2,FALSE),\"\")","v":""},""]
[null,null,{"$f":"IFERROR(VLOOKUP(A31,'Services-Produits'!A8:B127,2,FALSE),\"\")","v":""},""]
[null,null,{"$f":"IFERROR(VLOOKUP(A32,'Services-Produits'!A9:B128,2,FALSE),\"\")","v":""},""]
[null,null,{"$f":"IFERROR(VLOOKUP(A33,'Services-Produits'!A10:B129,2,FALSE),\"\")","v":""},""]
[null,null,{"$f":"IFERROR(VLOOKUP(A34,'Services-Produits'!A11:B130,2,FALSE),\"\")","v":""},""]
[null,null,{"$f":"IFERROR(VLOOKUP(A35,'Services-Produits'!A12:B131,2,FALSE),\"\")","v":""},""]
[null,null,{"$f":"IFERROR(VLOOKUP(A36,'Services-Produits'!A13:B132,2,FALSE),\"\")","v":""},""]
[null,null,{"$f":"IFERROR(VLOOKUP(A37,'Services-Produits'!A14:B133,2,FALSE),\"\")","v":""}]
["Total in CHF",null,null,{"$f":"SUM(D17:D37)","v":37424.559999999998}]
[]
["Thank you very much for your trust!"]
{"$rows_left_out":1}
{"sheet":"Wahyu Widada","index":5,"n_rows":22,"n_cols":1,"rows_kept":22,"cut":false,"hidden":false,"merged":[]}
["Services-Produits"]
["Reference"]
["Patients"]
["Muhamad Mardiono"]
["Wahyu Widada"]
["Test 2 pages"]
["Feuil2"]
["Feuil3"]
["Feuil4"]
["Reference1"]
["Menu"]
[]
[]
[]
["Agus Andriyanto"]
["Agus Andriyanto"]
["Agus Andriyanto"]
["Agus Andriyanto"]
["Agus Andriyanto"]
["Agus Andriyanto"]
["Agus Andriyanto"]
["Agus Andriyanto"]

{"sheet":"Test 2 pages","index":6,"n_rows":39,"n_cols":8,"rows_kept":39,"cut":false,"hidden":false,"merged":[]}
[5346]
[]
["Invoice: 55H-0231115"]
["                  23.12.2023"]
[null,null,"Treatment by",null,"Description","Qty","Price","Amount"]
[null,null,"Dr. Roger Gmür",null,"Patient: Deddy Prasetyo, M, 26.07.1968"]
[null,null,"Zürich"]
[null,null,null,null,"Gut Microbiome Therapy",4,{"$f":"IFERROR(VLOOKUP(E8,'Services-Produits'!#REF!,2,FALSE),\"\")","v":""},{"$f":"IFERROR(F8*G8,\"\")","v":""}]
["Mr. Deddy Prasetyo",null,null,null,"curcumin 75 mg",1,{"$f":"IFERROR(VLOOKUP(E9,'Services-Produits'!#REF!,2,FALSE),\"\")","v":""},{"$f":"IFERROR(F9*G9,\"\")","v":""}]
["Jakarta",null,null,null,"Bosvene Akba",1,{"$f":"IFERROR(VLOOKUP(E10,'Services-Produits'!#REF!,2,FALSE),\"\")","v":""},""]
["Indonesia",null,null,null,"Gynophilus",1,{"$f":"IFERROR(VLOOKUP(E11,'Services-Produits'!#REF!,2,FALSE),\"\")","v":""},""]
[null,null,null,null,null,null,{"$f":"IFERROR(VLOOKUP(E12,'Services-Produits'!#REF!,2,FALSE),\"\")","v":""},""]
[null,null,null,null,null,null,{"$f":"IFERROR(VLOOKUP(E13,'Services-Produits'!#REF!,2,FALSE),\"\")","v":""},""]
["Description","Qty","Price","Amount",null,null,{"$f":"IFERROR(VLOOKUP(E14,'Services-Produits'!#REF!,2,FALSE),\"\")","v":""},""]
["Patient: Deddy Prasetyo, M, 26.07.1968",null,null,null,null,null,{"$f":"IFERROR(VLOOKUP(E15,'Services-Produits'!#REF!,2,FALSE),\"\")","v":""},""]
[null,null,null,null,null,null,{"$f":"IFERROR(VLOOKUP(E16,'Services-Produits'!#REF!,2,FALSE),\"\")","v":""},""]
["Gut Microbiome Therapy",4,{"$f":"IFERROR(VLOOKUP(A17,'Services-Produits'!A1:B120,2,FALSE),\"\")","v":6912.5},{"$f":"IFERROR(B17*C17,\"\")","v":27650},null,null,{"$f":"IFERROR(VLOOKUP(E17,'Services-Produits'!E1:F120,2,FALSE),\"\")","v":""},""]
["curcumin 75 mg",1,{"$f":"IFERROR(VLOOKUP(A18,'Services-Produits'!A2:B121,2,FALSE),\"\")","v":116.22},{"$f":"IFERROR(B18*C18,\"\")","v":116.22},null,null,{"$f":"IFERROR(VLOOKUP(E18,'Services-Produits'!E2:F121,2,FALSE),\"\")","v":""},""]
["Bosvene Akba",1,{"$f":"IFERROR(VLOOKUP(A19,'Services-Produits'!A3:B122,2,FALSE),\"\")","v":215.11},215.11,null,null,{"$f":"IFERROR(VLOOKUP(E19,'Services-Produits'!E3:F122,2,FALSE),\"\")","v":""},""]
["Gynophilus",1,{"$f":"IFERROR(VLOOKUP(A20,'Services-Produits'!A4:B123,2,FALSE),\"\")","v":19.8},19.8,null,null,{"$f":"IFERROR(VLOOKUP(E20,'Services-Produits'!E4:F123,2,FALSE),\"\")","v":""},""]
["Microbiome",8,{"$f":"IFERROR(VLOOKUP(A21,'Services-Produits'!A5:B124,2,FALSE),\"\")","v":74.95},599.6,null,null,{"$f":"IFERROR(VLOOKUP(E21,'Services-Produits'!E5:F124,2,FALSE),\"\")","v":""},""]
["Vit, B Komplex",1,{"$f":"IFERROR(VLOOKUP(A22,'Services-Produits'!A6:B125,2,FALSE),\"\")","v":46.8},46.8,null,null,{"$f":"IFERROR(VLOOKUP(E22,'Services-Produits'!#REF!,2,FALSE),\"\")","v":""},""]
["Fermanose",2,{"$f":"IFERROR(VLOOKUP(A23,'Services-Produits'!A7:B126,2,FALSE),\"\")","v":46.2},92.4,null,null,{"$f":"IFERROR(VLOOKUP(E23,'Services-Produits'!#REF!,2,FALSE),\"\")","v":""},""]
["Fermanose",6,{"$f":"IFERROR(VLOOKUP(A24,'Services-Produits'!A8:B127,2,FALSE),\"\")","v":46.2},277.20000000000005,null,null,{"$f":"IFERROR(VLOOKUP(E24,'Services-Produits'!E1:F120,2,FALSE),\"\")","v":""},""]
["Oliphenolia",1,{"$f":"IFERROR(VLOOKUP(A25,'Services-Produits'!A9:B128,2,FALSE),\"\")","v":183.51},183.51,null,null,{"$f":"IFERROR(VLOOKUP(E25,'Services-Produits'!E2:F121,2,FALSE),\"\")","v":""},""]
[null,null,{"$f":"IFERROR(VLOOKUP(A26,'Services-Produits'!A10:B129,2,FALSE),\"\")","v":""},"",null,null,{"$f":"IFERROR(VLOOKUP(E26,'Services-Produits'!E3:F122,2,FALSE),\"\")","v":""},""]
[null,null,{"$f":"IFERROR(VLOOKUP(A27,'Services-Produits'!A11:B130,2,FALSE),\"\")","v":""},"",null,null,{"$f":"IFERROR(VLOOKUP(E27,'Services-Produits'!E4:F123,2,FALSE),\"\")","v":""},""]
[null,6,{"$f":"IFERROR(VLOOKUP(A28,'Services-Produits'!A12:B131,2,FALSE),\"\")","v":""},"",null,null,{"$f":"IFERROR(VLOOKUP(E28,'Services-Produits'!E5:F124,2,FALSE),\"\")","v":""}]
[null,1,{"$f":"IFERROR(VLOOKUP(A29,'Services-Produits'!A13:B132,2,FALSE),\"\")","v":""},"","Total in CHF",null,null,{"$f":"SUM(H8:H28)","v":0}]
[null,1,{"$f":"IFERROR(VLOOKUP(A30,'Services-Produits'!A14:B133,2,FALSE),\"\")","v":""},""]
[null,null,{"$f":"IFERROR(VLOOKUP(A31,'Services-Produits'!A8:B127,2,FALSE),\"\")","v":""},"","Thank you very much for your trust!"]
[null,1,{"$f":"IFERROR(VLOOKUP(A32,'Services-Produits'!A9:B128,2,FALSE),\"\")","v":""},""]
[null,8,{"$f":"IFERROR(VLOOKUP(A33,'Services-Produits'!A10:B129,2,FALSE),\"\")","v":""},""]
[null,1,{"$f":"IFERROR(VLOOKUP(A34,'Services-Produits'!A11:B130,2,FALSE),\"\")","v":""},""]
[null,2,{"$f":"IFERROR(VLOOKUP(A35,'Services-Produits'!A12:B131,2,FALSE),\"\")","v":""},""]
[null,9,{"$f":"IFERROR(VLOOKUP(A36,'Services-Produits'!A13:B132,2,FALSE),\"\")","v":""},""]
[]
[null,null,{"$f":"IFERROR(VLOOKUP(A38,'Services-Produits'!A14:B133,2,FALSE),\"\")","v":""}]
["Total in CHF",null,null,{"$f":"SUM(D17:D38)","v":29200.639999999999}]

{"sheet":"Feuil2","index":7,"n_rows":9,"n_cols":7,"rows_kept":9,"cut":false,"hidden":false,"merged":[]}
[123412.3,"Couleur","Choix",null,null,"Que pensez vous de ma programation ?","Prévoyez vous de développer un nouveau projet?"]
[23876.1,"Bleu","OUI",null,null,"Pourrait être mieux","Pas encore maintenant"]
[125756.23,"Rouge","NON"]
[1776.2,"Jaune","OUI"]
[287699.34000000003]
[2328767.1]
[1238976]
[239898.7]
[846465]

{"sheet":"Feuil3","index":8,"n_rows":40,"n_cols":8,"rows_kept":40,"cut":false,"hidden":false,"merged":[]}
["Nom","Adresse1","Adresse2","Ville","Pays","Sexe","Naissance","Entreprise"]
["Adex Yudiswan",null,null,"Jakarta","Indinesia","M","23.11.1978","SM"]
["Agus Andriyanto",null,null,"Jakarta","Indonesia","M","1967-02-16","SM"]
["Armand Wahyudi Hartono",null,null,"Jakarta","Indonesia","M","1975-05-20","SM"]
["Budi Satrio",null,null,"Jakarta","Indonesia","M","12.09.1987","SBL"]
["Chan Choi Moi",null,null,"Jakarta","Indonesia","F","17.04.1968","SM"]
["Deddy Prasetyo",null,null,"Jakarta","Indonesia","M","19.07.1970","SM"]
["Dian Suri Iriani",null,null,"Jakarta","Indonesia","F","02.08.1979","SBL"]
["Dobias Iskandar",null,null,"Jakarta","Indonesia","M","1965-11-16","SM"]
["Eileen Patricia Hartono",null,null,"Jakarta","Indonesia","F","1973-05-01","SBL"]
["Erminda Melayeni",null,null,"Jakarta","Indonesia","F","1975-10-25","SM"]
["Escy Soeleiman",null,null,"Jakarta","Indonesia","F","1965-12-09","SBL"]
["Evy Celiyanti",null,null,"Jakarta","Indonesia","F","1972-03-07","SM"]
["Herman Herry Adranacus",null,null,"Jakarta","Indonesia","M","1962-11-26","SM"]
["Isandi Harahap",null,null,"Jakarta","Indonesia","M","1958-12-10","SBL"]
["Karyoto",null,null,"Jakarta","Indonesia","M","1968-10-27","SBL"]
["Leonardo Di Caprio",null,null,"Madrid","Espagne","M","12.03.2001","SM"]
["Lina Iskandar",null,null,"Jakarta","Indonesia","F","1970-06-25","SBL"]
["Martha Dwi Maryani",null,null,"Jakarta","Indonesia","F","1969-05-21","SM"]
["Muhamad Mardiono",null,null,"Jakarta","Indonesia","M","1957-07-11","SM"]
["Muljadi Tjahjono",null,null,"Jakarta","Indonesia","M","1965-07-22","SM"]
["Nicolas Marius Boeschlin",null,null,"Bern","Suisse","M","20.03.2009","SBL"]
["Nyoman Adhi Suryadnyana",null,null,"Jakarta","Indonesia","M","1974-10-15","SBL"]
["Pierre Boeschlin",null,null,"Bern","Suisse","M","1960-03-19","SM"]
["Romyus Permana",null,null,"Jakarta","Indonesia","M","1978-10-20","SBL"]
["Salim Lan Jaya Liem",null,null,"Jakarta","Indonesia","M","1971-06-01","SM"]
["Samuel Bob",null,null,"Jakarta","Indonesia","M","1974-01-04","SM"]
["Samuel Rusli",null,null,"Jakarta","Indonesia","M","1968-04-01","SM"]
["Shanti Tan",null,null,"Jakarta","Indonesia","F","1978-09-10","SBL"]
["Shu Shu",null,null,"Jakarta","Indonesia","F","11.06.1991","SBL"]
["Sri Wahyuswinta",null,null,"Jakarta","Indonesia","F","1969-04-04","SM"]
["Tan Kim Siong",null,null,"Jakarta","Indonesia","M","1970-11-09","SM"]
["Tan Siew Chang",null,null,"Jakarta","Indonesia","F","1967-01-13","SM"]
["Titi Salim",null,null,"Jakarta","Indonesia","M","1971-06-01","SBL"]
["Wahyu Widada",null,null,"Jakarta","Indonesia","M","1969-09-11","SM"]
["Wisnu Hermawan",null,null,"Jakarta","Indonesia","M","1972-02-16","SM"]
["Yenni Rista S",null,null,"Jakarta","Indonesia","F","1958-07-18","SBL"]
["Yenny Wijaya",null,null,"Jakarta","Indonesia","F","1973-03-16","SM"]
["Yuldi Yusman",null,null,"Jakarta","Indonesia","M","1975-07-29","SM"]
["Yulia Gunawan",null,null,"Jakarta","Indonesia","F","1983-01-06","SM"]
{"$rows_left_out":1}
{"sheet":"Feuil4","index":9,"n_rows":95,"n_cols":2,"rows_kept":95,"cut":false,"hidden":false,"merged":[]}
["Korticobra",120.3]
["Abbott Freestyle 2",91.4]
["Abbott Sensor",65.3]
["Bactoflor",69.8]
["Biotin",37.25]
["Biotin + NaCl",37.25]
["B-Kompleks",46.8]
["Black cumin capsules",34.799999999999997]
["Bosvene Akba",215.11]
["Cholin Inject",43]
["C-Intercell 650 mg Vitamin C, 90 Kapseln",27.99]
["Curcumin + NaCl 0,9%",116.22]
["Curcumin 150 mg",229.2]
["curcumin 75 mg",116.22]
["E-Inject",41.2]
["Epinativ Injection",133.61000000000001]
["Face treatment Chin contouring",600]
["Fermanose",46.2]
["Fiber-Intercell",40.49]
["Gut Microbiome Therapy",6912.5]
["Gynophilus",19.8]
["Gynophylus",19.8]
["Hepar",43.7]
["Hydroxiprolin",68.900000000000006]
["Hypericin",198.7]
["Immunocare",220]
["Immunocare, personalised",195.7]
["Infraorbital",600]
["Infusion: Curcumin 75 mg",116.22]
["Infusion: Nicotiamide",179.8]
["Infusion: Shoga Öl",670]
["Jantung (Herz)",584.5]
["Jorodata3",435]
["K2 & D3",34.700000000000003]
["Kantong kemih (Harnblase)",381.35]
["Kartabra",201.48]
["Laetia",45.3]
["Liserotota",345.3]
["Liv 52",14.9]
["Magentropfen",23]
{"$rows_left_out":56}
{"sheet":"Reference1","index":10,"n_rows":40,"n_cols":4,"rows_kept":40,"cut":false,"hidden":false,"merged":[]}
[]
[]
["Invoice: 55H-0231115"]
["                  10.01.2024"]
[null,null,"Treatment by"]
[null,null,"Dr. Roger Gmür"]
[null,null,"Zürich"]
[]
[]
[]
[]
[]
[]
["Description","Qty","Price","Amount"]
[]
[]
["Gut Microbiome Therapy",4,{"$f":"IFERROR(VLOOKUP(A17,'Services-Produits'!A1:B120,2,FALSE),\"\")","v":6912.5},{"$f":"IFERROR(B17*C17,\"\")","v":27650}]
["Vit D3",3,{"$f":"IFERROR(VLOOKUP(A18,'Services-Produits'!A2:B121,2,FALSE),\"\")","v":37},{"$f":"IFERROR(B18*C18,\"\")","v":111}]
["Infraorbital",5,{"$f":"IFERROR(VLOOKUP(A19,'Services-Produits'!A3:B122,2,FALSE),\"\")","v":600},3000]
["Microbiome",1,{"$f":"IFERROR(VLOOKUP(A20,'Services-Produits'!A4:B123,2,FALSE),\"\")","v":74.95},74.95]
["Neuro Amino",24,{"$f":"IFERROR(VLOOKUP(A21,'Services-Produits'!A5:B124,2,FALSE),\"\")","v":163.19999999999999},3916.7999999999997]
[null,null,{"$f":"IFERROR(VLOOKUP(A22,'Services-Produits'!A6:B125,2,FALSE),\"\")","v":""},""]
[null,null,{"$f":"IFERROR(VLOOKUP(A23,'Services-Produits'!A7:B126,2,FALSE),\"\")","v":""},""]
[null,null,{"$f":"IFERROR(VLOOKUP(A24,'Services-Produits'!A8:B127,2,FALSE),\"\")","v":""},""]
[null,null,{"$f":"IFERROR(VLOOKUP(A25,'Services-Produits'!A9:B128,2,FALSE),\"\")","v":""},""]
[null,null,{"$f":"IFERROR(VLOOKUP(A26,'Services-Produits'!A10:B129,2,FALSE),\"\")","v":""},""]
[null,null,{"$f":"IFERROR(VLOOKUP(A27,'Services-Produits'!A11:B130,2,FALSE),\"\")","v":""},""]
[null,null,{"$f":"IFERROR(VLOOKUP(A28,'Services-Produits'!A12:B131,2,FALSE),\"\")","v":""},""]
[null,null,{"$f":"IFERROR(VLOOKUP(A29,'Services-Produits'!A13:B132,2,FALSE),\"\")","v":""},""]
[null,null,{"$f":"IFERROR(VLOOKUP(A30,'Services-Produits'!A14:B133,2,FALSE),\"\")","v":""},""]
[null,null,{"$f":"IFERROR(VLOOKUP(A31,'Services-Produits'!A8:B127,2,FALSE),\"\")","v":""},""]
[null,null,{"$f":"IFERROR(VLOOKUP(A32,'Services-Produits'!A9:B128,2,FALSE),\"\")","v":""},""]
[null,null,{"$f":"IFERROR(VLOOKUP(A33,'Services-Produits'!A10:B129,2,FALSE),\"\")","v":""},""]
[null,null,{"$f":"IFERROR(VLOOKUP(A34,'Services-Produits'!A11:B130,2,FALSE),\"\")","v":""},""]
[null,null,{"$f":"IFERROR(VLOOKUP(A35,'Services-Produits'!A12:B131,2,FALSE),\"\")","v":""},""]
[null,null,{"$f":"IFERROR(VLOOKUP(A36,'Services-Produits'!A13:B132,2,FALSE),\"\")","v":""},""]
[null,null,{"$f":"IFERROR(VLOOKUP(A37,'Services-Produits'!A14:B133,2,FALSE),\"\")","v":""}]
["Total in CHF",null,null,{"$f":"SUM(D17:D37)","v":34752.75}]
[]
["Thank you very much for your trust!"]
{"$rows_left_out":1}
{"sheet":"Menu","index":11,"n_rows":0,"n_cols":0,"rows_kept":0,"cut":false,"hidden":false,"merged":[]}