{"text_format":"1","workbook":"xlsx","n_sheets":14,"sheets":["Services-Produits","Reference","Patients","Theresia","Retina","HH","Adit","Gadiza","Cun","Samuel","Dobias Iskandar","Titi Salim","Test 2 pages","Ita Yuliati"],"not_rendered":{"charts":0,"images":6,"macros":1,"external_links":1,"defined_names":1,"comments":0,"pivot_tables":0},"unopened":[],"bounds":{"document_bytes":16777216,"sheet_cells":100000,"rows_first":2000,"rows_last":500,"rows_between":2000,"halvings":0,"cell_chars":16384,"cell_head_chars":4096},"cells_cut":0,"cells_raw":0,"read":"whole","date_system":"1900"}

{"sheet":"Services-Produits","index":0,"n_rows":114,"n_cols":2,"rows_kept":114,"cut":false,"hidden":false,"merged":[]}
["Produit","Price"]
["Abbott Freestyle 2",91.4]
["Abbott Sensor",65.3]
["Bactoflor-2023",69.8]
["Biotin",37.25]
["Biotin + NaCl",37.25]
["B-Kompleks",46.8]
["Black cumin capsules",34.799999999999997]
["Bosvene Akba",215.11]
["Cholin Inject",43]
["C-Intercell 650 mg Vitamin C, 90 Kapseln",27.99]
["Curcumin + NaCl 0,9%",116.22]
["Curcumin 150 mg",229.2]
["curcumin 75 mg",116.22]
["E-Inject",41.2]
["Epinativ Injection",133.61000000000001]
["Face treatment Chin contouring",600]
["Fermanose",46.2]
["Fiber-Intercell",40.49]
["Gut Microbiome Therapy",6912.5]
{"$rows_left_out":95}
{"sheet":"Reference","index":1,"n_rows":40,"n_cols":4,"rows_kept":40,"cut":false,"hidden":false,"merged":[]}
[]
[]
["Invoice: 55H-92401004"]
["                  04.02.2024"]
[null,null,"Treatment by"]
[null,null,"Dr. Roger Gmür"]
[null,null,"Zürich"]
[]
[]
[]
[]
[]
[]
["Description","Qty","Price","Amount"]
[]
[]
["Gut Microbiome Therapy",4,{"$f":"IFERROR(VLOOKUP(A17,'Services-Produits'!A1:B119,2,FALSE),\"\")","v":6912.5},{"$f":"IFERROR(B17*C17,\"\")","v":27650}]
[null,null,{"$f":"IFERROR(VLOOKUP(A18,'Services-Produits'!A2:B120,2,FALSE),\"\")","v":""},{"$f":"IFERROR(B18*C18,\"\")","v":""}]
[null,null,{"$f":"IFERROR(VLOOKUP(A19,'Services-Produits'!A3:B121,2,FALSE),\"\")","v":""},""]
[null,null,{"$f":"IFERROR(VLOOKUP(A20,'Services-Produits'!A4:B122,2,FALSE),\"\")","v":""},""]
{"$rows_left_out":21}
{"sheet":"Patients","index":2,"n_rows":49,"n_cols":8,"rows_kept":49,"cut":false,"hidden":false,"merged":[]}
["Adex Yudiswan",null,null,"Jakarta","Indonesia","M","1974-12-03","SM"]
["Agus Andriyanto",null,null,"Jakarta","Indonesia","M","1967-02-16","SM"]
["Armand Wahyudi Hartono",null,null,"Jakarta","Indonesia","M","1975-05-20","SM"]
["Budi Satrio",null,null,"Jakarta","Indonesia","M","1976-05-31","SBL"]
["Chan Choi Moi",null,null,"Jakarta","Indonesia","F","1972-04-28","SM"]
["Deddy Prasetyo",null,null,"Jakarta","Indonesia","M","1968-07-26","SM"]
["Dian Suri Iriani",null,null,"Jakarta","Indonesia","F","1979-08-02","SBL"]
["Dobias Iskandar",null,null,"Jakarta","Indonesia","M","1965-11-16","SM"]
["Eileen Patricia Hartono",null,null,"Jakarta","Indonesia","F","1973-05-01","SBL"]
["Erminda Melayeni",null,null,"Jakarta","Indonesia","F","1975-10-25","SM"]
["Escy Soeleiman",null,null,"Jakarta","Indonesia","F","1965-12-09","SBL"]
["Evy Celiyanti",null,null,"Jakarta","Indonesia","F","1972-03-07","SM"]
["Herman Herry Adranacus",null,null,"Jakarta","Indonesia","M","1962-11-26","SM"]
["Isandi Harahap",null,null,"Jakarta","Indonesia","M","1958-12-10","SBL"]
["Karyoto",null,null,"Jakarta","Indonesia","M","1968-10-27","SBL"]
["Lina Iskandar",null,null,"Jakarta","Indonesia","F","1970-06-25","SBL"]
["Martha Dwi Maryani",null,null,"Jakarta","Indonesia","F","1969-05-21","SM"]
["Muhamad Mardiono",null,null,"Jakarta","Indonesia","M","1957-07-11","SM"]
["Muljadi Tjahjono",null,null,"Jakarta","Indonesia","M","1965-07-22","SM"]
["Nyoman Adhi Suryadnyana",null,null,"Jakarta","Indonesia","M","1974-10-15","SBL"]
{"$rows_left_out":30}
{"sheet":"Theresia","index":3,"n_rows":40,"n_cols":4,"rows_kept":40,"cut":false,"hidden":false,"merged":[]}
[]
[]
["Invoice: 55H-92401004"]
["                  04.02.2024"]
[]
[]
[]
[]
["Mrs. Theresia"]
["Jakarta"]
["Indonesia"]
[]
[]
["Description","Qty","Price","Amount"]
["Patient: Theresia, , "]
[]
["Repatha",3,{"$f":"IFERROR(VLOOKUP(A17,'Services-Produits'!A1:B119,2,FALSE),\"\")","v":233.55},{"$f":"IFERROR(B17*C17,\"\")","v":700.65000000000009}]
["Omega 7",2,{"$f":"IFERROR(VLOOKUP(A18,'Services-Produits'!A2:B120,2,FALSE),\"\")","v":82.6},{"$f":"IFERROR(B18*C18,\"\")","v":165.2}]
["Protokoll Lösung 1",1,{"$f":"IFERROR(VLOOKUP(A19,'Services-Produits'!A3:B121,2,FALSE),\"\")","v":147.19999999999999},147.19999999999999]
["Spermidin",1,{"$f":"IFERROR(VLOOKUP(A20,'Services-Produits'!A4:B122,2,FALSE),\"\")","v":182.35},182.35]
{"$rows_left_out":21}
{"sheet":"Retina","index":4,"n_rows":40,"n_cols":4,"rows_kept":40,"cut":false,"hidden":false,"merged":[]}
[]
[]
["Invoice: 55H-92401004"]
["                  04.02.2024"]
[]
[]
[]
[]
["Mrs. Retina"]
["Jakarta"]
["Indonesia"]
[]
[]
["Description","Qty","Price","Amount"]
["Patient: Retina, , "]
[]
["Microcare",0,{"$f":"IFERROR(VLOOKUP(A17,'Services-Produits'!A1:B119,2,FALSE),\"\")","v":0},{"$f":"IFERROR(B17*C17,\"\")","v":0}]
["Xarelto",1,{"$f":"IFERROR(VLOOKUP(A18,'Services-Produits'!A2:B120,2,FALSE),\"\")","v":42.15},{"$f":"IFERROR(B18*C18,\"\")","v":42.15}]
[null,null,{"$f":"IFERROR(VLOOKUP(A19,'Services-Produits'!A3:B121,2,FALSE),\"\")","v":""},""]
[null,null,{"$f":"IFERROR(VLOOKUP(A20,'Services-Produits'!A4:B122,2,FALSE),\"\")","v":""},""]
{"$rows_left_out":21}
{"sheet":"HH","index":5,"n_rows":40,"n_cols":4,"rows_kept":40,"cut":false,"hidden":false,"merged":[]}
[]
[]
["Invoice: 55H-92401004"]
["                  04.02.2024"]
[]
[]
[]
[]
["Mrs. HH"]
["Jakarta"]
["Indonesia"]
[]
[]
["Description","Qty","Price","Amount"]
["Patient: HH, , "]
[]
["Tamsulosin ",5,{"$f":"IFERROR(VLOOKUP(A17,'Services-Produits'!A1:B119,2,FALSE),\"\")","v":59.9},{"$f":"IFERROR(B17*C17,\"\")","v":299.5}]
["Tadalafil-Mepha 10 mg",5,{"$f":"IFERROR(VLOOKUP(A18,'Services-Produits'!A2:B120,2,FALSE),\"\")","v":115},{"$f":"IFERROR(B18*C18,\"\")","v":575}]
[null,null,{"$f":"IFERROR(VLOOKUP(A19,'Services-Produits'!A3:B121,2,FALSE),\"\")","v":""},""]
[null,null,{"$f":"IFERROR(VLOOKUP(A20,'Services-Produits'!A4:B122,2,FALSE),\"\")","v":""},""]
{"$rows_left_out":21}
{"sheet":"Adit","index":6,"n_rows":40,"n_cols":4,"rows_kept":40,"cut":false,"hidden":false,"merged":[]}
[]
[]
["Invoice: 55H-92401004"]
["                  04.02.2024"]
[]
[]
[]
[]
["Mrs. Adit"]
["Jakarta"]
["Indonesia"]
[]
[]
["Description","Qty","Price","Amount"]
["Patient: Adit, , "]
[]
["Microcare",0,{"$f":"IFERROR(VLOOKUP(A17,'Services-Produits'!A1:B119,2,FALSE),\"\")","v":0},{"$f":"IFERROR(B17*C17,\"\")","v":0}]
[null,null,{"$f":"IFERROR(VLOOKUP(A18,'Services-Produits'!A2:B120,2,FALSE),\"\")","v":""},{"$f":"IFERROR(B18*C18,\"\")","v":""}]
[null,null,{"$f":"IFERROR(VLOOKUP(A19,'Services-Produits'!A3:B121,2,FALSE),\"\")","v":""},""]
[null,null,{"$f":"IFERROR(VLOOKUP(A20,'Services-Produits'!A4:B122,2,FALSE),\"\")","v":""},""]
{"$rows_left_out":21}
{"sheet":"Gadiza","index":7,"n_rows":40,"n_cols":4,"rows_kept":40,"cut":false,"hidden":false,"merged":[]}
[]
[]
["Invoice: 55H-92401004"]
["                  04.02.2024"]
[]
[]
[]
[]
["Mrs. Gadiza"]
["Jakarta"]
["Indonesia"]
[]
[]
["Description","Qty","Price","Amount"]
["Patient: Gadiza, , "]
[]
["Epinativ Injection",3,{"$f":"IFERROR(VLOOKUP(A17,'Services-Produits'!A1:B119,2,FALSE),\"\")","v":133.61000000000001},{"$f":"IFERROR(B17*C17,\"\")","v":400.83000000000004}]
["Curcumin 150 mg",1,{"$f":"IFERROR(VLOOKUP(A18,'Services-Produits'!A2:B120,2,FALSE),\"\")","v":229.2},{"$f":"IFERROR(B18*C18,\"\")","v":229.2}]
["Riboflavin",1,{"$f":"IFERROR(VLOOKUP(A19,'Services-Produits'!A3:B121,2,FALSE),\"\")","v":127.4},127.4]
[null,null,{"$f":"IFERROR(VLOOKUP(A20,'Services-Produits'!A4:B122,2,FALSE),\"\")","v":""},""]
{"$rows_left_out":21}
{"sheet":"Cun","index":8,"n_rows":40,"n_cols":4,"rows_kept":40,"cut":false,"hidden":false,"merged":[]}
[]
[]
["Invoice: 55H-9240100X"]
["                  29.01.2024"]
[]
[]
[]
[]
["Mrs. Cun"]
["Jakarta"]
["Indonesia"]
[]
[]
["Description","Qty","Price","Amount"]
["Patient: Cun, , "]
[]
["Microcare",0,{"$f":"IFERROR(VLOOKUP(A17,'Services-Produits'!A1:B119,2,FALSE),\"\")","v":0},{"$f":"IFERROR(B17*C17,\"\")","v":0}]
["Cholin Inject",1,{"$f":"IFERROR(VLOOKUP(A18,'Services-Produits'!A2:B120,2,FALSE),\"\")","v":43},{"$f":"IFERROR(B18*C18,\"\")","v":43}]
[null,null,{"$f":"IFERROR(VLOOKUP(A19,'Services-Produits'!A3:B121,2,FALSE),\"\")","v":""},""]
[null,null,{"$f":"IFERROR(VLOOKUP(A20,'Services-Produits'!A4:B122,2,FALSE),\"\")","v":""},""]
{"$rows_left_out":21}
{"sheet":"Samuel","index":9,"n_rows":40,"n_cols":4,"rows_kept":40,"cut":false,"hidden":false,"merged":[]}
[]
[]
["Invoice: 55H-9240100X"]
["                  04.02.2024"]
[]
[]
[]
[]
["Mrs. Samuel"]
["Jakarta"]
["Indonesia"]
[]
[]
["Description","Qty","Price","Amount"]
["Patient: Samuel, , "]
[]
["Microcare",0,{"$f":"IFERROR(VLOOKUP(A17,'Services-Produits'!A1:B119,2,FALSE),\"\")","v":0},{"$f":"IFERROR(B17*C17,\"\")","v":0}]
["Bactoflor",1,{"$f":"IFERROR(VLOOKUP(A18,'Services-Produits'!A2:B120,2,FALSE),\"\")","v":47.8},{"$f":"IFERROR(B18*C18,\"\")","v":47.8}]
[null,null,{"$f":"IFERROR(VLOOKUP(A19,'Services-Produits'!A3:B121,2,FALSE),\"\")","v":""},""]
[null,null,{"$f":"IFERROR(VLOOKUP(A20,'Services-Produits'!A4:B122,2,FALSE),\"\")","v":""},""]
{"$rows_left_out":21}
{"sheet":"Dobias Iskandar","index":10,"n_rows":40,"n_cols":4,"rows_kept":40,"cut":false,"hidden":false,"merged":[]}
[]
[]
["Invoice: 55H-92401005"]
["                  29.01.2024"]
[]
[]
[]
[]
["Mr. Dobias Iskandar"]
["Jakarta"]
["Indonesia"]
[]
[]
["Description","Qty","Price","Amount"]
["Patient: Dobias Iskandar, M, 16.11.1965"]
[]
["Cholin Inject",10,{"$f":"IFERROR(VLOOKUP(A17,'Services-Produits'!A1:B119,2,FALSE),\"\")","v":43},{"$f":"IFERROR(B17*C17,\"\")","v":430}]
["Microbiome",5,{"$f":"IFERROR(VLOOKUP(A18,'Services-Produits'!A2:B120,2,FALSE),\"\")","v":74.95},{"$f":"IFERROR(B18*C18,\"\")","v":374.75}]
["Omega 7",1,{"$f":"IFERROR(VLOOKUP(A19,'Services-Produits'!A3:B121,2,FALSE),\"\")","v":82.6},82.6]
["Tadalafil-Mepha 10 mg",5,{"$f":"IFERROR(VLOOKUP(A20,'Services-Produits'!A4:B122,2,FALSE),\"\")","v":115},575]
{"$rows_left_out":21}
{"sheet":"Titi Salim","index":11,"n_rows":40,"n_cols":4,"rows_kept":40,"cut":false,"hidden":false,"merged":[]}
[]
[]
["Invoice: 55H-92401004"]
["                  29.01.2024"]
[]
[]
[]
[]
["Mr. Titi Salim"]
["Jakarta"]
["Indonesia"]
[]
[]
["Description","Qty","Price","Amount"]
["Patient: Titi Salim, M, 01.06.1971"]
[]
["Microbiome",3,{"$f":"IFERROR(VLOOKUP(A17,'Services-Produits'!A1:B119,2,FALSE),\"\")","v":74.95},{"$f":"IFERROR(B17*C17,\"\")","v":224.85000000000002}]
["Microcare personalised",1,{"$f":"IFERROR(VLOOKUP(A18,'Services-Produits'!A2:B120,2,FALSE),\"\")","v":0},{"$f":"IFERROR(B18*C18,\"\")","v":0}]
["Omega 7",1,{"$f":"IFERROR(VLOOKUP(A19,'Services-Produits'!A3:B121,2,FALSE),\"\")","v":82.6},82.6]
["Abbott Freestyle libre",3,{"$f":"IFERROR(VLOOKUP(A20,'Services-Produits'!A4:B122,2,FALSE),\"\")","v":91.4},274.20000000000005]
{"$rows_left_out":21}
{"sheet":"Test 2 pages","index":12,"n_rows":39,"n_cols":8,"rows_kept":39,"cut":false,"hidden":false,"merged":[]}
[5346]
[]
["Invoice: 55H-0231115"]
["                  23.12.2023"]
[null,null,"Treatment by",null,"Description","Qty","Price","Amount"]
[null,null,"Dr. Roger Gmür",null,"Patient: Deddy Prasetyo, M, 26.07.1968"]
[null,null,"Zürich"]
[null,null,null,null,"Gut Microbiome Therapy",4,{"$f":"IFERROR(VLOOKUP(E8,'Services-Produits'!#REF!,2,FALSE),\"\")","v":""},{"$f":"IFERROR(F8*G8,\"\")","v":""}]
["Mr. Deddy Prasetyo",null,null,null,"curcumin 75 mg",1,{"$f":"IFERROR(VLOOKUP(E9,'Services-Produits'!#REF!,2,FALSE),\"\")","v":""},{"$f":"IFERROR(F9*G9,\"\")","v":""}]
["Jakarta",null,null,null,"Bosvene Akba",1,{"$f":"IFERROR(VLOOKUP(E10,'Services-Produits'!#REF!,2,FALSE),\"\")","v":""},""]
["Indonesia",null,null,null,"Gynophilus",1,{"$f":"IFERROR(VLOOKUP(E11,'Services-Produits'!#REF!,2,FALSE),\"\")","v":""},""]
[null,null,null,null,null,null,{"$f":"IFERROR(VLOOKUP(E12,'Services-Produits'!#REF!,2,FALSE),\"\")","v":""},""]
[null,null,null,null,null,null,{"$f":"IFERROR(VLOOKUP(E13,'Services-Produits'!#REF!,2,FALSE),\"\")","v":""},""]
["Description","Qty","Price","Amount",null,null,{"$f":"IFERROR(VLOOKUP(E14,'Services-Produits'!#REF!,2,FALSE),\"\")","v":""},""]
["Patient: Deddy Prasetyo, M, 26.07.1968",null,null,null,null,null,{"$f":"IFERROR(VLOOKUP(E15,'Services-Produits'!#REF!,2,FALSE),\"\")","v":""},""]
[null,null,null,null,null,null,{"$f":"IFERROR(VLOOKUP(E16,'Services-Produits'!#REF!,2,FALSE),\"\")","v":""},""]
["Gut Microbiome Therapy",4,{"$f":"IFERROR(VLOOKUP(A17,'Services-Produits'!A1:B119,2,FALSE),\"\")","v":6912.5},{"$f":"IFERROR(B17*C17,\"\")","v":27650},null,null,{"$f":"IFERROR(VLOOKUP(E17,'Services-Produits'!E1:F119,2,FALSE),\"\")","v":""},""]
["curcumin 75 mg",1,{"$f":"IFERROR(VLOOKUP(A18,'Services-Produits'!A2:B120,2,FALSE),\"\")","v":116.22},{"$f":"IFERROR(B18*C18,\"\")","v":116.22},null,null,{"$f":"IFERROR(VLOOKUP(E18,'Services-Produits'!E2:F120,2,FALSE),\"\")","v":""},""]
["Bosvene Akba",1,{"$f":"IFERROR(VLOOKUP(A19,'Services-Produits'!A3:B121,2,FALSE),\"\")","v":215.11},215.11,null,null,{"$f":"IFERROR(VLOOKUP(E19,'Services-Produits'!E3:F121,2,FALSE),\"\")","v":""},""]
["Gynophilus",1,{"$f":"IFERROR(VLOOKUP(A20,'Services-Produits'!A4:B122,2,FALSE),\"\")","v":19.8},19.8,null,null,{"$f":"IFERROR(VLOOKUP(E20,'Services-Produits'!E4:F122,2,FALSE),\"\")","v":""},""]
{"$rows_left_out":20}
{"sheet":"Ita Yuliati","index":13,"n_rows":41,"n_cols":4,"rows_kept":41,"cut":false,"hidden":false,"merged":[]}
[]
[]
["Invoice: 55H-92401001"]
["                  29.01.2024"]
[]
[]
[]
[]
["Mrs. Ita Yuliati"]
["Jakarta"]
["Indonesia"]
[]
[]
["Description","Qty","Price","Amount"]
["Patient: Ita Yuliati, F, 30.07.1960"]
[]
["Gut Microbiome Therapy",4,{"$f":"IFERROR(VLOOKUP(A17,'[1]Services-Produits'!A1:B120,2,FALSE),\"\")","v":7199.75},{"$f":"IFERROR(B17*C17,\"\")","v":28799}]
[]
["Infusion:"]
["Curcumin 150 mg",1,{"$f":"IFERROR(VLOOKUP(A20,'[1]Services-Produits'!A3:B122,2,FALSE),\"\")","v":229.2},{"$f":"IFERROR(B20*C20,\"\")","v":229.2}]
{"$rows_left_out":21}