{"text_format":"1","workbook":"xlsx","n_sheets":29,"sheets":["Refund Invoice","Ahnar Magenda1","Mrs. Yenni Rista","Sambodo Purnomo","Ahnar Magenda","Rizal","Aboe Bakar","Ita Yuliati","Agung Yadha Adhi Nuqraha","Bridjen Pol Tonny Hermawan","Wisnu Soehardono","Dobias Iskandar","Peter Pramana","Herman Herry Adranacus","Thiha Aung","Adex Yudiswan","Muljadi Tjahjono","Herly Julianti","Invoices 18.11.24","Vino","Aboe Bakar-1","Agus Andriyanto","Erlin Diyanto Hong","Aqung Yadha Adhi Nuqraha","ReferenceSBL","Services-Produits","Reference","Patients","Reference2p"],"not_rendered":{"charts":0,"images":6,"macros":1,"external_links":0,"defined_names":3,"comments":0,"pivot_tables":0},"unopened":[],"bounds":{"document_bytes":16777216,"sheet_cells":100000,"rows_first":2000,"rows_last":500,"rows_between":2000,"halvings":0,"cell_chars":16384,"cell_head_chars":4096},"cells_cut":0,"cells_raw":0,"read":"whole","date_system":"1900"}

{"sheet":"Refund Invoice","index":0,"n_rows":40,"n_cols":4,"rows_kept":40,"cut":false,"hidden":false,"merged":[]}
[]
[]
["Refund Invoice"]
["2024-12-10"]
[]
[]
[]
[]
[]
[]
[]
[]
[]
["Description","Qty","Price","Amount"]
[]
{"$rows_left_out":26}
{"sheet":"Ahnar Magenda1","index":1,"n_rows":42,"n_cols":4,"rows_kept":42,"cut":false,"hidden":false,"merged":[]}
[]
[]
["Invoice: 55H-02411-GM19"]
["                  18.11.2024"]
[]
[]
[]
[]
[]
["Mr. Ahnar Magenda"]
["Jakarta"]
["Indonesia"]
[]
["Description","Qty","Price","Amount"]
[]
{"$rows_left_out":28}
{"sheet":"Mrs. Yenni Rista","index":2,"n_rows":28,"n_cols":4,"rows_kept":28,"cut":false,"hidden":false,"merged":[]}
[]
[]
["Invoice: 55H-02305-GM01"]
["                  24.05.2023"]
[]
[]
[]
[]
[]
["Mrs. Yenni Rista"]
["Jakarta"]
["Indonesia"]
[]
["Description","Qty","Price","Amount"]
["Patient: Yenni Rista, F, 18.07.1958"]
{"$rows_left_out":14}
{"sheet":"Sambodo Purnomo","index":3,"n_rows":40,"n_cols":4,"rows_kept":40,"cut":false,"hidden":false,"merged":[]}
[]
[]
["Invoice: 55H-02420-GM01"]
["                  20.12.2024"]
[]
[]
[]
[]
["Mr. Sambodo Purnomo"]
["Jakarta"]
["Indonesia"]
[]
[]
["Description","Qty","Price","Amount"]
["Patient: Sambodo Purnomo, M, 03.07.1973"]
{"$rows_left_out":26}
{"sheet":"Ahnar Magenda","index":4,"n_rows":42,"n_cols":4,"rows_kept":42,"cut":false,"hidden":false,"merged":[]}
[]
[]
["Invoice: 55H-02411-GM17"]
["                  18.11.2024"]
[]
[]
[]
[]
[]
["Mr. Ahnar Magenda"]
["Jakarta"]
["Indonesia"]
[]
["Description","Qty","Price","Amount"]
["Immun Akut",7,{"$f":"IFERROR(VLOOKUP(A15,'Services-Produits'!$A$1:$B$2000,2,FALSE),\"\")","v":66.25},{"$f":"IFERROR(B15*C15,\"\")","v":463.75}]
{"$rows_left_out":28}
{"sheet":"Rizal","index":5,"n_rows":40,"n_cols":4,"rows_kept":40,"cut":false,"hidden":false,"merged":[]}
[]
[]
["Invoice: 55H-02412-GM02"]
["                  05.12.2024"]
[]
[]
[]
[]
["Mr. Rizal"]
["Jakarta"]
["Indonesia"]
[]
[]
["Description","Qty","Price","Amount"]
["Patient: Rizal, M"]
{"$rows_left_out":26}
{"sheet":"Aboe Bakar","index":6,"n_rows":40,"n_cols":4,"rows_kept":40,"cut":false,"hidden":false,"merged":[]}
[]
[]
["Invoice: 55H-02412-GM01"]
["                  05.12.2024"]
[]
[]
[]
[]
["Mr. Aboe Bakar"]
["Jakarta"]
["Indonesia"]
[]
[]
["Description","Qty","Price","Amount"]
["Patient: Aboe Bakar, M, 15.10.1969"]
{"$rows_left_out":26}
{"sheet":"Ita Yuliati","index":7,"n_rows":28,"n_cols":4,"rows_kept":28,"cut":false,"hidden":false,"merged":[]}
[]
[]
["Invoice: 55H-02411-GM04"]
["                  18.11.2024"]
[]
[]
[]
[]
[]
["Ita Yuliati"]
["Jakarta"]
["Indonesia"]
[]
["Description","Qty","Price","Amount"]
["Patient: Ita Yuliati, F"]
{"$rows_left_out":14}
{"sheet":"Agung Yadha Adhi Nuqraha","index":8,"n_rows":40,"n_cols":4,"rows_kept":40,"cut":false,"hidden":false,"merged":[]}
[]
[]
["Invoice: 55H-02411-GM18"]
["                  18.11.2024"]
[]
[]
[]
[]
["Mr. Agung Yadha Adhi Nuqraha"]
["Jakarta"]
["Indonesia"]
[]
[]
["Description","Qty","Price","Amount"]
["Patient: Agung Yadha Adhi Nuqraha, M, 29.06.1981"]
{"$rows_left_out":26}
{"sheet":"Bridjen Pol Tonny Hermawan","index":9,"n_rows":28,"n_cols":4,"rows_kept":28,"cut":false,"hidden":false,"merged":[]}
[]
[]
["Invoice: 55H-02411-GM02"]
["                  18.11.2024"]
[]
[]
[]
[]
[]
["Mr. Bridjen Pol Tonny Hermawan"]
["Jakarta"]
["Indonesia"]
[]
["Description","Qty","Price","Amount"]
["Patient: Budi Gunawan, M"]
{"$rows_left_out":14}
{"sheet":"Wisnu Soehardono","index":10,"n_rows":27,"n_cols":4,"rows_kept":27,"cut":false,"hidden":false,"merged":[]}
[]
[]
["Invoice: 55H-02411-GM03"]
["                  18.11.2024"]
[]
[]
[]
[]
[]
["Mr. Wisnu Soehardono"]
["Jakarta"]
["Indonesia"]
[]
["Description","Qty","Price","Amount"]
["Patient: Wisnu Soehardono, M"]
{"$rows_left_out":13}
{"sheet":"Dobias Iskandar","index":11,"n_rows":40,"n_cols":4,"rows_kept":40,"cut":false,"hidden":false,"merged":[]}
[]
[]
["Invoice: 55H-02411-GM05"]
["                  18.11.2024"]
[]
[]
[]
[]
["Mr. Dobias Iskandar"]
["Jakarta"]
["Indonesia"]
[]
[]
["Description","Qty","Price","Amount"]
["Patient: Dobias Iskandar, M, 16.11.1965"]
{"$rows_left_out":26}
{"sheet":"Peter Pramana","index":12,"n_rows":40,"n_cols":4,"rows_kept":40,"cut":false,"hidden":false,"merged":[]}
[]
[]
["Invoice: 55H-02411-GM06"]
["                  18.11.2024"]
[]
[]
[]
[]
["Mr. Peter Pramana"]
["Jakarta"]
["Indonesia"]
[]
[]
["Description","Qty","Price","Amount"]
["Patient: Peter Pramana, M, 10.08.1974"]
{"$rows_left_out":26}
{"sheet":"Herman Herry Adranacus","index":13,"n_rows":40,"n_cols":4,"rows_kept":40,"cut":false,"hidden":false,"merged":[]}
[]
[]
["Invoice: 55H-02411-GM07"]
["                  18.11.2024"]
[]
[]
[]
[]
["Mr. Herman Herry Adranacus"]
["Jakarta"]
["Indonesia"]
[]
[]
["Description","Qty","Price","Amount"]
["Patient: Herman Herry Adranacus, M, 26.11.1962"]
{"$rows_left_out":26}
{"sheet":"Thiha Aung","index":14,"n_rows":40,"n_cols":4,"rows_kept":40,"cut":false,"hidden":false,"merged":[]}
[]
[]
["Invoice: 55H-02411-GM08"]
["                  18.11.2024"]
[]
[]
[]
[]
["Mr. Thiha Aung"]
["Jakarta"]
["Indonesia"]
[]
[]
["Description","Qty","Price","Amount"]
["Patient: Thiha Aung, M, 19.09.1974"]
{"$rows_left_out":26}
{"sheet":"Adex Yudiswan","index":15,"n_rows":40,"n_cols":4,"rows_kept":40,"cut":false,"hidden":false,"merged":[]}
[]
[]
["Invoice: 55H-02411-GM09"]
["                  18.11.2024"]
[]
[]
[]
[]
["Mr. Adex Yudiswan"]
["Jakarta"]
["Indonesia"]
[]
[]
["Description","Qty","Price","Amount"]
["Patient: Adex Yudiswan, M, 01.12.1974"]
{"$rows_left_out":26}
{"sheet":"Muljadi Tjahjono","index":16,"n_rows":40,"n_cols":4,"rows_kept":40,"cut":false,"hidden":false,"merged":[]}
[]
[]
["Invoice: 55H-02411-GM10"]
["                  18.11.2024"]
[]
[]
[]
[]
["Mr. Muljadi Tjahjono"]
["Jakarta"]
["Indonesia"]
[]
[]
["Description","Qty","Price","Amount"]
["Patient: Muljadi Tjahjono, M, 22.01.1965"]
{"$rows_left_out":26}
{"sheet":"Herly Julianti","index":17,"n_rows":40,"n_cols":4,"rows_kept":40,"cut":false,"hidden":false,"merged":[]}
[]
[]
["Invoice: 55H-02411-GM016"]
["                  18.11.2024"]
[]
[]
[]
[]
["Mr. Herly Julianti"]
["Jakarta"]
["Indonesia"]
[]
[]
["Description","Qty","Price","Amount"]
["Patient: Herly Julianti, M, 01.07.1975"]
{"$rows_left_out":26}
{"sheet":"Invoices 18.11.24","index":18,"n_rows":20,"n_cols":5,"rows_kept":20,"cut":false,"hidden":false,"merged":[[1,0,1,4]]}
[]
["Invoices from 18.11.2024"]
["Patient name","Invoice Nr.","SM/SBL","Amount(CHF)","Amount(IDR)"]
["Bridjen Pol Tonny Hermawan"," 55H-02411-GM02","SBL",2490.9]
["Wisnu Soehardono"," 55H-02411-GM03","SBL",1948.24]
["Ita Yuliati"," 55H-02411-GM04","SBL",357.9]
["Dobias Iskandar"," 55H-02411-GM05","SM",2358.85]
["Peter Pramana"," 55H-02411-GM06","SM",221.7]
["Herman Herry Adranacus"," 55H-02411-GM07","SM",19714.509999999998]
["Thiha Aung"," 55H-02411-GM08","SM",14399.5]
["Adex Yudiswan"," 55H-02411-GM09","SM",3349.69]
["Muljadi Tjahjono"," 55H-02411-GM10","SM",49798.7]
["Vino Romano"," 55H-02411-GM11","SM",888.75]
["Aboe Bakar"," 55H-02411-GM12","SM",3643.85]
["Agus Adrianto"," 55H-02411-GM13","SM",20292.849999999999]
{"$rows_left_out":6}
{"sheet":"Vino","index":19,"n_rows":40,"n_cols":4,"rows_kept":40,"cut":false,"hidden":false,"merged":[]}
[]
[]
["Invoice: 55H-02411-GM11"]
["                  18.11.2024"]
[]
[]
[]
[]
["Mrs. Vino Romano"]
["Jakarta"]
["Indonesia"]
[]
[]
["Description","Qty","Price","Amount"]
["Patient: Vino Romano,  M, 11.11.1988"]
{"$rows_left_out":26}
{"sheet":"Aboe Bakar-1","index":20,"n_rows":40,"n_cols":4,"rows_kept":40,"cut":false,"hidden":false,"merged":[]}
[]
[]
["Invoice: 55H-02411-GM12"]
["                  18.11.2024"]
[]
[]
[]
[]
["Mr. Aboe Bakar"]
["Jakarta"]
["Indonesia"]
[]
[]
["Description","Qty","Price","Amount"]
["Patient: Aboe Bakar, M, 15.10.1969"]
{"$rows_left_out":26}
{"sheet":"Agus Andriyanto","index":21,"n_rows":40,"n_cols":4,"rows_kept":40,"cut":false,"hidden":false,"merged":[]}
[]
[]
["Invoice: 55H-02411-GM13"]
["                  18.11.2024"]
[]
[]
[]
[]
["Mr. Agus Andriyanto"]
["Jakarta"]
["Indonesia"]
[]
[]
["Description","Qty","Price","Amount"]
["Patient: Agus Andriyanto, M, 16.02.1967"]
{"$rows_left_out":26}
{"sheet":"Erlin Diyanto Hong","index":22,"n_rows":41,"n_cols":4,"rows_kept":41,"cut":false,"hidden":false,"merged":[]}
[]
[]
["Invoice: 55H-02411-GM14"]
["                  18.11.2024"]
[]
[]
[]
[]
["Mrs. Erlin Diyanto Hong"]
["Jakarta"]
["Indonesia"]
[]
[]
["Description","Qty","Price","Amount"]
["Patient: Erlin Diyanto Hong, F, 20.11.1979"]
{"$rows_left_out":27}
{"sheet":"Aqung Yadha Adhi Nuqraha","index":23,"n_rows":40,"n_cols":4,"rows_kept":40,"cut":false,"hidden":false,"merged":[]}
[]
[]
["Invoice: 55H-02411-GM15"]
["                  18.11.2024"]
[]
[]
[]
[]
["Mr. Agung Yadha Adhi Nuqraha"]
["Jakarta"]
["Indonesia"]
[]
[]
["Description","Qty","Price","Amount"]
["Patient: Agung Yadha Adhi Nuqraha, M, 29.06.1981"]
{"$rows_left_out":26}
{"sheet":"ReferenceSBL","index":24,"n_rows":40,"n_cols":4,"rows_kept":40,"cut":false,"hidden":false,"merged":[]}
[]
[]
["Invoice: 55H-02411-GM02"]
["                  18.11.2024"]
[]
[]
[]
[]
[]
["Mrs. Yenni Rista"]
["Jakarta"]
["Indonesia"]
[]
["Description","Qty","Price","Amount"]
["Patient: Yenni Rista, F, 18.07.1958"]
{"$rows_left_out":26}
{"sheet":"Services-Produits","index":25,"n_rows":228,"n_cols":3,"rows_kept":228,"cut":false,"hidden":false,"merged":[]}
["Produit","Price","Old price"]
[" Respiphage",419.5]
["Abbott Freestyle 2",91.4]
["Abbott Sensor",65.3]
["ADEK",37.6]
["Ampuwa 10 ml",0]
["Anesthesie"]
["Antioxidant Infusion",410]
["Antioxidant Mix",410]
["Artesunat",67.2]
["Bactoflor",69.8]
["Beloc Zok 25 mg",16.5]
["Bioflorin",18.350000000000001]
["Biotin",37.25]
["Biotin + NaCl",37.25]
{"$rows_left_out":214}
{"sheet":"Reference","index":26,"n_rows":40,"n_cols":4,"rows_kept":40,"cut":false,"hidden":false,"merged":[]}
[]
[]
["Invoice: 55H-02411-GM04"]
["                  20.12.2024"]
[]
[]
[]
[]
[]
[]
[]
[]
[]
["Description","Qty","Price","Amount"]
[]
{"$rows_left_out":26}
{"sheet":"Patients","index":27,"n_rows":72,"n_cols":13,"rows_kept":72,"cut":false,"hidden":false,"merged":[]}
["Nom","Adresse","CP","Ville","Pays","Sexe","Date Naissance","Entreprise"]
["Aboe Bakar",null,null,"Jakarta","Indonesia","M","1969-10-15","SM"]
["Adex Yudiswan",null,null,"Jakarta","Indonesia","M","1974-12-03","SM"]
["Adex Yudiswan",null,null,"Jakarta","Indonesia","M","1974-12-01","SM",null,null,null,"Discount5",-0.05]
["Agus Andriyanto",null,null,"Jakarta","Indonesia","M","1967-02-16","SM",null,null,null,"Discount10",-0.1]
["Almahyra Cyrilla Sastroisvara",null,null,"Jakarta","Indonesia","F",null,null,null,null,null,"Discount15",-0.15]
["Andrea Wulandari Iravan",null,null,"Jakarta","Indonesia","F","1995-08-07","N",null,null,null,"Discount20",-0.2]
["Agung Yadha Adhi Nuqraha",null,null,"Jakarta","Indonesia","M","1981-06-29","SM",null,null,null,"Discount25",-0.25]
["Armand Wahyudi Hartono",null,null,"Jakarta","Indonesia","M","1975-05-20","SM",null,null,null,"Discount30",-0.3]
["Budi Satrio",null,null,"Jakarta","Indonesia","M","1976-05-31","SBL",null,null,null,"Discount35",-0.35]
["Chan Choi Moi",null,null,"Jakarta","Indonesia","F","1972-04-28","SM",null,null,null,"Discount40",-0.4]
["Darmo Pranoto Soenjoto",null,null,"Jakarta","Indonesia","M","1946-06-20","N",null,null,null,"Discount45",-0.45]
["Deddy Prasetyo",null,null,"Jakarta","Indonesia","M","1968-07-26","SM",null,null,null,"Discount50",-0.5]
["Dian Siswarini",null,null,"Jakarta","Indonesia","F","1968-05-05","SM",null,null,null,"Discount55",-0.55000000000000004]
["Dian Suri Iriani",null,null,"Jakarta","Indonesia","F","1979-08-02","SBL",null,null,null,"Discount60",-0.6]
{"$rows_left_out":58}
{"sheet":"Reference2p","index":28,"n_rows":41,"n_cols":8,"rows_kept":41,"cut":false,"hidden":false,"merged":[]}
[]
[]
["Invoice: 55H-02406-GM11"]
["                  04.07.2024"]
[null,null,"Treatment by",null,"Description","Qty","Price","Amount"]
[null,null,"Dr. Roland Backhaus"]
[]
[null,null,null,null,null,null,{"$f":"IFERROR(VLOOKUP(E8,'Services-Produits'!$A$1:$B$2000,2,FALSE),\"\")","v":""},{"$f":"IFERROR(F8*G8,\"\")","v":""}]
[null,null,null,null,null,null,{"$f":"IFERROR(VLOOKUP(E9,'Services-Produits'!$A$1:$B$2000,2,FALSE),\"\")","v":""},{"$f":"IFERROR(F9*G9,\"\")","v":""}]
[null,null,null,null,null,null,{"$f":"IFERROR(VLOOKUP(E10,'Services-Produits'!$A$1:$B$2000,2,FALSE),\"\")","v":""},""]
[null,null,null,null,null,null,{"$f":"IFERROR(VLOOKUP(E11,'Services-Produits'!$A$1:$B$2000,2,FALSE),\"\")","v":""},""]
[null,null,null,null,null,null,{"$f":"IFERROR(VLOOKUP(E12,'Services-Produits'!$A$1:$B$2000,2,FALSE),\"\")","v":""},""]
[null,null,null,null,null,null,{"$f":"IFERROR(VLOOKUP(E13,'Services-Produits'!$A$1:$B$2000,2,FALSE),\"\")","v":""},""]
["Description","Qty","Price","Amount",null,null,{"$f":"IFERROR(VLOOKUP(E14,'Services-Produits'!$A$1:$B$2000,2,FALSE),\"\")","v":""},""]
[null,null,null,null,null,null,{"$f":"IFERROR(VLOOKUP(E15,'Services-Produits'!$A$1:$B$2000,2,FALSE),\"\")","v":""},""]
{"$rows_left_out":26}