{"text_format":"1","workbook":"xlsx","n_sheets":17,"sheets":["Services-Produits","Reference","Patients","Wisnu Hermawan","Wahyu Hadiningrat","Agus Andriyanto","Putri Kusuma Mardiono","Muhamad Mardiono","Fajar Hadi Prabowo","Murat Ismael","Ong Hang Ling","Peter Pramana","Andrea Wulandari Iravan","Darmo Pranoto Soenjoto","Prodjo Handajo Sunjoto","Nonda Nellyana Djaja","Reference2p"],"not_rendered":{"charts":0,"images":3,"macros":1,"external_links":0,"defined_names":3,"comments":0,"pivot_tables":0},"unopened":[],"bounds":{"document_bytes":16777216,"sheet_cells":100000,"rows_first":2000,"rows_last":500,"rows_between":2000,"halvings":0,"cell_chars":16384,"cell_head_chars":4096},"cells_cut":0,"cells_raw":0,"read":"whole","date_system":"1900"}

{"sheet":"Services-Produits","index":0,"n_rows":164,"n_cols":4,"rows_kept":164,"cut":false,"hidden":false,"merged":[]}
["Produit","Price"]
["Abbott Freestyle 2",91.4]
["Abbott Sensor",65.3]
["Antioxidant Mix",410]
["Artesunat",67.2]
["Bactoflor",69.8]
["Biotin",37.25]
["Biotin + NaCl",37.25]
["B-Kompleks",46.8]
["Black cumin capsules",34.799999999999997]
["Bosvene Akba",215.11]
["Brain Mapping",2148]
["Calcium gluconat",22.6]
["Cholin Inject",43]
["C-Intercell 650 mg Vitamin C, 90 Kapseln",27.99]
["Consultation",1800]
["Creon 25000",111.75]
["Curcumin + NaCl 0,9%",116.22]
["Curcumin 150 mg",229.2]
["Curcumin 75 mg",116.22]
{"$rows_left_out":145}
{"sheet":"Reference","index":1,"n_rows":40,"n_cols":4,"rows_kept":40,"cut":false,"hidden":false,"merged":[]}
[]
[]
["Invoice: 55H-02406-GM11"]
["                  23.09.2024"]
[null,null,"Treatment by"]
[null,null,"Dr. Roland Backhaus"]
[]
[]
[]
[]
[]
[]
[]
["Description","Qty","Price","Amount"]
[]
[]
[null,null,{"$f":"IFERROR(VLOOKUP(A17,'Services-Produits'!$A$1:$B$2000,2,FALSE),\"\")","v":""},{"$f":"IFERROR(B17*C17,\"\")","v":""}]
[null,null,{"$f":"IFERROR(VLOOKUP(A18,'Services-Produits'!$A$1:$B$2000,2,FALSE),\"\")","v":""},{"$f":"IFERROR(B18*C18,\"\")","v":""}]
[null,null,{"$f":"IFERROR(VLOOKUP(A19,'Services-Produits'!$A$1:$B$2000,2,FALSE),\"\")","v":""},""]
[null,null,{"$f":"IFERROR(VLOOKUP(A20,'Services-Produits'!$A$1:$B$2000,2,FALSE),\"\")","v":""},""]
{"$rows_left_out":21}
{"sheet":"Patients","index":2,"n_rows":60,"n_cols":13,"rows_kept":60,"cut":false,"hidden":false,"merged":[]}
["Adex Yudiswan",null,null,"Jakarta","Indonesia","M","1974-12-03","SM"]
["Agus Andriyanto",null,null,"Jakarta","Indonesia","M","1967-02-16","SM"]
["Andrea Wulandari Iravan",null,null,"Jakarta","Indonesia","F","1995-08-07","N",null,null,null,"Discount5",-0.05]
["Armand Wahyudi Hartono",null,null,"Jakarta","Indonesia","M","1975-05-20","SM",null,null,null,"Discount10",-0.1]
["Budi Satrio",null,null,"Jakarta","Indonesia","M","1976-05-31","SBL",null,null,null,"Discount15",-0.15]
["Chan Choi Moi",null,null,"Jakarta","Indonesia","F","1972-04-28","SM",null,null,null,"Discount20",-0.2]
["Darmo Pranoto Soenjoto",null,null,"Jakarta","Indonesia","M","1946-06-20","N",null,null,null,"Discount25",-0.25]
["Deddy Prasetyo",null,null,"Jakarta","Indonesia","M","1968-07-26","SM",null,null,null,"Discount30",-0.3]
["Dian Siswarini",null,null,"Jakarta","Indonesia","F","1968-05-05","SM",null,null,null,"Discount35",-0.35]
["Dian Suri Iriani",null,null,"Jakarta","Indonesia","F","1979-08-02","SBL",null,null,null,"Discount40",-0.4]
["Dobias Iskandar",null,null,"Jakarta","Indonesia","M","1965-11-16","SM",null,null,null,"Discount45",-0.45]
["Doni Irawan Soenarso",null,null,"Jakarta","Indonesia","M","1957-07-11","SM",null,null,null,"Discount50",-0.5]
["Dr. Putri Kusuma",null,null,"Jakarta","Indonesia","F","1969-01-07","SM",null,null,null,"Discount55",-0.55000000000000004]
["Eileen Patricia Hartono",null,null,"Jakarta","Indonesia","F","1973-05-01","SBL",null,null,null,"Discount60",-0.6]
["Erminda Melayeni",null,null,"Jakarta","Indonesia","F","1975-10-25","SM",null,null,null,"Discount65",-0.65]
["Escy Soeleiman",null,null,"Jakarta","Indonesia","F","1965-12-09","SBL",null,null,null,"Discount70",-0.7]
["Evy Celiyanti",null,null,"Jakarta","Indonesia","F","1972-03-07","SM",null,null,null,"Discount75",-0.75]
["Fajar Hadi Prabowo",null,null,"Jakarta","Indonesia","M","1989-11-14","N",null,null,null,"Discount80",-0.8]
["Herman Herry Adranacus",null,null,"Jakarta","Indonesia","M","1962-11-26","SM",null,null,null,"Discount85",-0.85]
["Isandi Harahap",null,null,"Jakarta","Indonesia","M","1958-12-10","SBL",null,null,null,"Discount90",-0.9]
{"$rows_left_out":41}
{"sheet":"Wisnu Hermawan","index":3,"n_rows":40,"n_cols":4,"rows_kept":40,"cut":false,"hidden":false,"merged":[]}
[]
[]
["Invoice: 55H-02406-GM11"]
["                  23.09.2024"]
[null,null,"Treatment by"]
[null,null,"Dr. Roland Backhaus"]
[]
[]
["Mr. Wisnu Hermawan"]
["Jakarta"]
["Indonesia"]
[]
[]
["Description","Qty","Price","Amount"]
["Patient: Wisnu Hermawan, M, 16.02.1972"]
[]
[null,null,{"$f":"IFERROR(VLOOKUP(A17,'Services-Produits'!$A$1:$B$2000,2,FALSE),\"\")","v":""},{"$f":"IFERROR(B17*C17,\"\")","v":""}]
[null,null,{"$f":"IFERROR(VLOOKUP(A18,'Services-Produits'!$A$1:$B$2000,2,FALSE),\"\")","v":""},{"$f":"IFERROR(B18*C18,\"\")","v":""}]
[null,null,{"$f":"IFERROR(VLOOKUP(A19,'Services-Produits'!$A$1:$B$2000,2,FALSE),\"\")","v":""},""]
[null,null,{"$f":"IFERROR(VLOOKUP(A20,'Services-Produits'!$A$1:$B$2000,2,FALSE),\"\")","v":""},""]
{"$rows_left_out":21}
{"sheet":"Wahyu Hadiningrat","index":4,"n_rows":40,"n_cols":4,"rows_kept":40,"cut":false,"hidden":false,"merged":[]}
[]
[]
["Invoice: 55H-02406-GM11"]
["                  23.09.2024"]
[null,null,"Treatment by"]
[null,null,"Dr. Roland Backhaus"]
[]
[]
["Mr. Wahyu Hadiningrat"]
["Jakarta"]
["Indonesia"]
[]
[]
["Description","Qty","Price","Amount"]
["Patient: Wahyu Hadiningrat, M, 06.05.1974"]
[]
[null,null,{"$f":"IFERROR(VLOOKUP(A17,'Services-Produits'!$A$1:$B$2000,2,FALSE),\"\")","v":""},{"$f":"IFERROR(B17*C17,\"\")","v":""}]
[null,null,{"$f":"IFERROR(VLOOKUP(A18,'Services-Produits'!$A$1:$B$2000,2,FALSE),\"\")","v":""},{"$f":"IFERROR(B18*C18,\"\")","v":""}]
[null,null,{"$f":"IFERROR(VLOOKUP(A19,'Services-Produits'!$A$1:$B$2000,2,FALSE),\"\")","v":""},""]
[null,null,{"$f":"IFERROR(VLOOKUP(A20,'Services-Produits'!$A$1:$B$2000,2,FALSE),\"\")","v":""},""]
{"$rows_left_out":21}
{"sheet":"Agus Andriyanto","index":5,"n_rows":40,"n_cols":4,"rows_kept":40,"cut":false,"hidden":false,"merged":[]}
[]
[]
["Invoice: 55H-02406-GM11"]
["                  23.09.2024"]
[null,null,"Treatment by"]
[null,null,"Dr. Roland Backhaus"]
[]
[]
["Mr. Agus Andriyanto"]
["Jakarta"]
["Indonesia"]
[]
[]
["Description","Qty","Price","Amount"]
["Patient: Agus Andriyanto, M, 16.02.1967"]
[]
["Gut Microbiome - 1 transplants",1,{"$f":"IFERROR(VLOOKUP(A17,'Services-Produits'!$A$1:$B$2000,2,FALSE),\"\")","v":7199.75},{"$f":"IFERROR(B17*C17,\"\")","v":7199.75}]
["Tadalafil-Mepha 2.5 mg",8,{"$f":"IFERROR(VLOOKUP(A18,'Services-Produits'!$A$1:$B$2000,2,FALSE),\"\")","v":115},{"$f":"IFERROR(B18*C18,\"\")","v":920}]
[" Respiphage",1,{"$f":"IFERROR(VLOOKUP(A19,'Services-Produits'!$A$1:$B$2000,2,FALSE),\"\")","v":0},{"$f":"IFERROR(B19*C19,\"\")","v":0}]
["Curcumin 150 mg",3,{"$f":"IFERROR(VLOOKUP(A20,'Services-Produits'!$A$1:$B$2000,2,FALSE),\"\")","v":229.2},687.59999999999991]
{"$rows_left_out":21}
{"sheet":"Putri Kusuma Mardiono","index":6,"n_rows":40,"n_cols":4,"rows_kept":40,"cut":false,"hidden":false,"merged":[]}
[]
[]
["Invoice: 55H-02406-GM11"]
["                  23.09.2024"]
[null,null,"Treatment by"]
[null,null,"Dr. Roland Backhaus"]
[]
[]
["Mrs. Putri Kusuma Mardiono"]
["Jakarta"]
["Indonesia"]
[]
[]
["Description","Qty","Price","Amount"]
["Patient: Putri Kusuma Mardiono, F, "]
[]
["Gut Microbiome 2 transplants",1,{"$f":"IFERROR(VLOOKUP(A17,'Services-Produits'!$A$1:$B$2000,2,FALSE),\"\")","v":14399.5},{"$f":"IFERROR(B17*C17,\"\")","v":14399.5}]
["Discount 15%",null,null,{"$f":"-D17*0.15","v":-2159.9249999999997}]
["Oliphenolia",6,{"$f":"IFERROR(VLOOKUP(A19,'Services-Produits'!$A$1:$B$2000,2,FALSE),\"\")","v":183.51},{"$f":"IFERROR(B19*C19,\"\")","v":1101.06}]
["Wegovy 0.5mg",3,{"$f":"IFERROR(VLOOKUP(A20,'Services-Produits'!$A$1:$B$2000,2,FALSE),\"\")","v":188.15},564.45000000000005]
{"$rows_left_out":21}
{"sheet":"Muhamad Mardiono","index":7,"n_rows":40,"n_cols":4,"rows_kept":40,"cut":false,"hidden":false,"merged":[]}
[]
[]
["Invoice: 55H-02406-GM11"]
["                  23.09.2024"]
[null,null,"Treatment by"]
[null,null,"Dr. Roland Backhaus"]
[]
[]
["Mr. Muhamad Mardiono"]
["Jakarta"]
["Indonesia"]
[]
[]
["Description","Qty","Price","Amount"]
["Patient: Muhamad Mardiono, M, 11.07.1957"]
[]
["Gut Microbiome 4 transplants",1,{"$f":"IFERROR(VLOOKUP(A17,'Services-Produits'!$A$1:$B$2000,2,FALSE),\"\")","v":28799},{"$f":"IFERROR(B17*C17,\"\")","v":28799}]
["Discount 15%",null,null,{"$f":"D17*Discount15","v":-4319.8499999999995}]
["Protokol Lösung 1 Infusion",1,{"$f":"IFERROR(VLOOKUP(A19,'Services-Produits'!$A$1:$B$2000,2,FALSE),\"\")","v":0},{"$f":"IFERROR(B19*C19,\"\")","v":0}]
["Tadalafil-Mepha 2.5 mg",6,{"$f":"IFERROR(VLOOKUP(A20,'Services-Produits'!$A$1:$B$2000,2,FALSE),\"\")","v":115},690]
{"$rows_left_out":21}
{"sheet":"Fajar Hadi Prabowo","index":8,"n_rows":40,"n_cols":4,"rows_kept":40,"cut":false,"hidden":false,"merged":[]}
[]
[]
["Invoice: 55H-02406-GM11"]
["                  23.09.2024"]
[null,null,"Treatment by"]
[null,null,"Dr. Roland Backhaus"]
[]
[]
["Mr. Fajar Hadi Prabowo"]
["Jakarta"]
["Indonesia"]
[]
[]
["Description","Qty","Price","Amount"]
["Patient: Fajar Hadi Prabowo, M, 14.11.1989"]
[]
[null,null,{"$f":"IFERROR(VLOOKUP(A17,'Services-Produits'!$A$1:$B$2000,2,FALSE),\"\")","v":""},{"$f":"IFERROR(B17*C17,\"\")","v":""}]
["Gut Microbiome 4 transplants",1,{"$f":"IFERROR(VLOOKUP(A18,'Services-Produits'!$A$1:$B$2000,2,FALSE),\"\")","v":28799},{"$f":"IFERROR(B18*C18,\"\")","v":28799}]
["Phenylalanine",1,{"$f":"IFERROR(VLOOKUP(A19,'Services-Produits'!$A$1:$B$2000,2,FALSE),\"\")","v":106.4},106.4]
["Consultation",1,{"$f":"IFERROR(VLOOKUP(A20,'Services-Produits'!$A$1:$B$2000,2,FALSE),\"\")","v":1800},1800]
{"$rows_left_out":21}
{"sheet":"Murat Ismael","index":9,"n_rows":40,"n_cols":4,"rows_kept":40,"cut":false,"hidden":false,"merged":[]}
[]
[]
["Invoice: 55H-02406-GM11"]
["                  23.09.2024"]
[null,null,"Treatment by"]
[null,null,"Dr. Roland Backhaus"]
[]
[]
["Mr. Murat Ismael"]
["Jakarta"]
["Indonesia"]
[]
[]
["Description","Qty","Price","Amount"]
["Patient: Murat Ismael, M, 11.09.1961"]
[]
["Gut Microbiome 4 transplants",1,{"$f":"IFERROR(VLOOKUP(A17,'Services-Produits'!$A$1:$B$2000,2,FALSE),\"\")","v":28799},{"$f":"IFERROR(B17*C17,\"\")","v":28799}]
["Antioxidant Mix",1,{"$f":"IFERROR(VLOOKUP(A18,'Services-Produits'!$A$1:$B$2000,2,FALSE),\"\")","v":410},{"$f":"IFERROR(B18*C18,\"\")","v":410}]
[null,null,{"$f":"IFERROR(VLOOKUP(A19,'Services-Produits'!$A$1:$B$2000,2,FALSE),\"\")","v":""},""]
[null,null,{"$f":"IFERROR(VLOOKUP(A20,'Services-Produits'!$A$1:$B$2000,2,FALSE),\"\")","v":""},""]
{"$rows_left_out":21}
{"sheet":"Ong Hang Ling","index":10,"n_rows":40,"n_cols":4,"rows_kept":40,"cut":false,"hidden":false,"merged":[]}
[]
[]
["Invoice: 55H-02406-GM11"]
["                  23.09.2024"]
[null,null,"Treatment by"]
[null,null,"Dr. Roland Backhaus"]
[]
[]
["Mr. Ong Hang Ling"]
["Jakarta"]
["Indonesia"]
[]
[]
["Description","Qty","Price","Amount"]
["Patient: Ong Hang Ling, M, 12.12.1938"]
[]
["Gut Microbiome 4 transplants",1,{"$f":"IFERROR(VLOOKUP(A17,'Services-Produits'!$A$1:$B$2000,2,FALSE),\"\")","v":28799},{"$f":"IFERROR(B17*C17,\"\")","v":28799}]
["Phago SES",2,{"$f":"IFERROR(VLOOKUP(A18,'Services-Produits'!$A$1:$B$2000,2,FALSE),\"\")","v":0},{"$f":"IFERROR(B18*C18,\"\")","v":0}]
["Phago PYO",1,{"$f":"IFERROR(VLOOKUP(A19,'Services-Produits'!$A$1:$B$2000,2,FALSE),\"\")","v":0},0]
["Cerebrolysin 5 ml",1,{"$f":"IFERROR(VLOOKUP(A20,'Services-Produits'!$A$1:$B$2000,2,FALSE),\"\")","v":63.8},63.8]
{"$rows_left_out":21}
{"sheet":"Peter Pramana","index":11,"n_rows":40,"n_cols":4,"rows_kept":40,"cut":false,"hidden":false,"merged":[]}
[]
[]
["Invoice: 55H-02406-GM11"]
["                  23.09.2024"]
[null,null,"Treatment by"]
[null,null,"Dr. Roland Backhaus"]
[]
[]
["Mr. Peter Pramana"]
["Jakarta"]
["Indonesia"]
[]
[]
["Description","Qty","Price","Amount"]
["Patient: Peter Pramana, M, 10.08.1974"]
[]
["Gut Microbiome 4 transplants",1,{"$f":"IFERROR(VLOOKUP(A17,'Services-Produits'!$A$1:$B$2000,2,FALSE),\"\")","v":28799},{"$f":"IFERROR(B17*C17,\"\")","v":28799}]
["NAD+",4,{"$f":"IFERROR(VLOOKUP(A18,'Services-Produits'!$A$1:$B$2000,2,FALSE),\"\")","v":219.66},{"$f":"IFERROR(B18*C18,\"\")","v":878.64}]
[null,null,{"$f":"IFERROR(VLOOKUP(A19,'Services-Produits'!$A$1:$B$2000,2,FALSE),\"\")","v":""},""]
[null,null,{"$f":"IFERROR(VLOOKUP(A20,'Services-Produits'!$A$1:$B$2000,2,FALSE),\"\")","v":""},""]
{"$rows_left_out":21}
{"sheet":"Andrea Wulandari Iravan","index":12,"n_rows":40,"n_cols":4,"rows_kept":40,"cut":false,"hidden":false,"merged":[]}
[]
[]
["Invoice: 55H-02406-GM11"]
["                  23.09.2024"]
[null,null,"Treatment by"]
[null,null,"Dr. Roland Backhaus"]
[]
[]
["Mrs. Andrea Wulandari Iravan"]
["Jakarta"]
["Indonesia"]
[]
[]
["Description","Qty","Price","Amount"]
["Patient: Andrea Wulandari Iravan, F, 07.08.1995"]
[]
["Gut Microbiome 4 transplants",1,{"$f":"IFERROR(VLOOKUP(A17,'Services-Produits'!$A$1:$B$2000,2,FALSE),\"\")","v":28799},{"$f":"IFERROR(B17*C17,\"\")","v":28799}]
["Phenylalanine",2,{"$f":"IFERROR(VLOOKUP(A18,'Services-Produits'!$A$1:$B$2000,2,FALSE),\"\")","v":106.4},{"$f":"IFERROR(B18*C18,\"\")","v":212.8}]
["Mitochondrien Infusion",1,{"$f":"IFERROR(VLOOKUP(A19,'Services-Produits'!$A$1:$B$2000,2,FALSE),\"\")","v":428.7},428.7]
["Hydroxiprolin 2 g",4,{"$f":"IFERROR(VLOOKUP(A20,'Services-Produits'!$A$1:$B$2000,2,FALSE),\"\")","v":68.900000000000006},275.60000000000002]
{"$rows_left_out":21}
{"sheet":"Darmo Pranoto Soenjoto","index":13,"n_rows":40,"n_cols":4,"rows_kept":40,"cut":false,"hidden":false,"merged":[]}
[]
[]
["Invoice: 55H-02406-GM11"]
["                  23.09.2024"]
[null,null,"Treatment by"]
[null,null,"Dr. Roland Backhaus"]
[]
[]
["Mr. Darmo Pranoto Soenjoto"]
["Jakarta"]
["Indonesia"]
[]
[]
["Description","Qty","Price","Amount"]
["Patient: Darmo Pranoto Soenjoto, M, 20.06.1946"]
[]
["Gut Microbiome 4 transplants",1,{"$f":"IFERROR(VLOOKUP(A17,'Services-Produits'!$A$1:$B$2000,2,FALSE),\"\")","v":28799},{"$f":"IFERROR(B17*C17,\"\")","v":28799}]
["Cerebrolysin 5 ml",1,{"$f":"IFERROR(VLOOKUP(A18,'Services-Produits'!$A$1:$B$2000,2,FALSE),\"\")","v":63.8},{"$f":"IFERROR(B18*C18,\"\")","v":63.8}]
["Gedächtnis Infusion",1,{"$f":"IFERROR(VLOOKUP(A19,'Services-Produits'!$A$1:$B$2000,2,FALSE),\"\")","v":378},378]
["Mitochondrien Infusion",2,{"$f":"IFERROR(VLOOKUP(A20,'Services-Produits'!$A$1:$B$2000,2,FALSE),\"\")","v":428.7},857.4]
{"$rows_left_out":21}
{"sheet":"Prodjo Handajo Sunjoto","index":14,"n_rows":40,"n_cols":4,"rows_kept":40,"cut":false,"hidden":false,"merged":[]}
[]
[]
["Invoice: 55H-02406-GM11"]
["                  23.09.2024"]
[null,null,"Treatment by"]
[null,null,"Dr. Roland Backhaus"]
[]
[]
["Mr. Prodjo Handajo Sunjoto"]
["Jakarta"]
["Indonesia"]
[]
[]
["Description","Qty","Price","Amount"]
["Patient: Prodjo Handajo Sunjoto, M, 17.08.1941"]
[]
["Gut Microbiome 2 transplants",1,{"$f":"IFERROR(VLOOKUP(A17,'Services-Produits'!$A$1:$B$2000,2,FALSE),\"\")","v":14399.5},{"$f":"IFERROR(B17*C17,\"\")","v":14399.5}]
["Discount 15%",null,null,{"$f":"D17*Discount15","v":-2159.9249999999997}]
["Cerebrolysin 10 ml",4,{"$f":"IFERROR(VLOOKUP(A19,'Services-Produits'!$A$1:$B$2000,2,FALSE),\"\")","v":99.6},{"$f":"IFERROR(B19*C19,\"\")","v":398.4}]
["Cerebrolysin 5 ml",1,{"$f":"IFERROR(VLOOKUP(A20,'Services-Produits'!$A$1:$B$2000,2,FALSE),\"\")","v":63.8},{"$f":"IFERROR(B20*C20,\"\")","v":63.8}]
{"$rows_left_out":21}
{"sheet":"Nonda Nellyana Djaja","index":15,"n_rows":40,"n_cols":4,"rows_kept":40,"cut":false,"hidden":false,"merged":[]}
[]
[]
["Invoice: 55H-02406-GM11"]
["                  23.09.2024"]
[null,null,"Treatment by"]
[null,null,"Dr. Roland Backhaus"]
[]
[]
["Mrs. Nonda Nellyana Djaja"]
["Jakarta"]
["Indonesia"]
[]
[]
["Description","Qty","Price","Amount"]
["Patient: Nonda Nellyana Djaja, F, 12.01.1948"]
[]
["Gut Microbiome 2 transplants",1,{"$f":"IFERROR(VLOOKUP(A17,'Services-Produits'!$A$1:$B$2000,2,FALSE),\"\")","v":14399.5},{"$f":"IFERROR(B17*C17,\"\")","v":14399.5}]
["Discount 15%",null,null,{"$f":"D17*Discount15","v":-2159.9249999999997}]
["DCA",18,{"$f":"IFERROR(VLOOKUP(A19,'Services-Produits'!$A$1:$B$2000,2,FALSE),\"\")","v":0},{"$f":"IFERROR(B19*C19,\"\")","v":0}]
["Artesunat",15,{"$f":"IFERROR(VLOOKUP(A20,'Services-Produits'!$A$1:$B$2000,2,FALSE),\"\")","v":67.2},1008]
{"$rows_left_out":21}
{"sheet":"Reference2p","index":16,"n_rows":41,"n_cols":8,"rows_kept":41,"cut":false,"hidden":false,"merged":[]}
[]
[]
["Invoice: 55H-02406-GM11"]
["                  04.07.2024"]
[null,null,"Treatment by",null,"Description","Qty","Price","Amount"]
[null,null,"Dr. Roland Backhaus"]
[]
[null,null,null,null,null,null,{"$f":"IFERROR(VLOOKUP(E8,'Services-Produits'!$A$1:$B$2000,2,FALSE),\"\")","v":""},{"$f":"IFERROR(F8*G8,\"\")","v":""}]
[null,null,null,null,null,null,{"$f":"IFERROR(VLOOKUP(E9,'Services-Produits'!$A$1:$B$2000,2,FALSE),\"\")","v":""},{"$f":"IFERROR(F9*G9,\"\")","v":""}]
[null,null,null,null,null,null,{"$f":"IFERROR(VLOOKUP(E10,'Services-Produits'!$A$1:$B$2000,2,FALSE),\"\")","v":""},""]
[null,null,null,null,null,null,{"$f":"IFERROR(VLOOKUP(E11,'Services-Produits'!$A$1:$B$2000,2,FALSE),\"\")","v":""},""]
[null,null,null,null,null,null,{"$f":"IFERROR(VLOOKUP(E12,'Services-Produits'!$A$1:$B$2000,2,FALSE),\"\")","v":""},""]
[null,null,null,null,null,null,{"$f":"IFERROR(VLOOKUP(E13,'Services-Produits'!$A$1:$B$2000,2,FALSE),\"\")","v":""},""]
["Description","Qty","Price","Amount",null,null,{"$f":"IFERROR(VLOOKUP(E14,'Services-Produits'!$A$1:$B$2000,2,FALSE),\"\")","v":""},""]
[null,null,null,null,null,null,{"$f":"IFERROR(VLOOKUP(E15,'Services-Produits'!$A$1:$B$2000,2,FALSE),\"\")","v":""},""]
[null,null,null,null,null,null,{"$f":"IFERROR(VLOOKUP(E16,'Services-Produits'!$A$1:$B$2000,2,FALSE),\"\")","v":""},""]
[null,null,{"$f":"IFERROR(VLOOKUP(A17,'Services-Produits'!$A$1:$B$2000,2,FALSE),\"\")","v":""},{"$f":"IFERROR(B17*C17,\"\")","v":""},null,null,{"$f":"IFERROR(VLOOKUP(E17,'Services-Produits'!$A$1:$B$2000,2,FALSE),\"\")","v":""},""]
[null,null,{"$f":"IFERROR(VLOOKUP(A18,'Services-Produits'!$A$1:$B$2000,2,FALSE),\"\")","v":""},{"$f":"IFERROR(B18*C18,\"\")","v":""},null,null,{"$f":"IFERROR(VLOOKUP(E18,'Services-Produits'!$A$1:$B$2000,2,FALSE),\"\")","v":""},""]
[null,null,{"$f":"IFERROR(VLOOKUP(A19,'Services-Produits'!$A$1:$B$2000,2,FALSE),\"\")","v":""},"",null,null,{"$f":"IFERROR(VLOOKUP(E19,'Services-Produits'!$A$1:$B$2000,2,FALSE),\"\")","v":""},""]
[null,null,{"$f":"IFERROR(VLOOKUP(A20,'Services-Produits'!$A$1:$B$2000,2,FALSE),\"\")","v":""},"",null,null,{"$f":"IFERROR(VLOOKUP(E20,'Services-Produits'!$A$1:$B$2000,2,FALSE),\"\")","v":""},{"$f":"IFERROR(F20*G20,\"\")","v":""}]
{"$rows_left_out":21}